program: Gaussian 09
title: 000155887
version: EM64L-G09RevD.01
frameworkgroup: C1[X(C21H18O3)]
method: RPBEPBE
basis: SDD
operation: Freq
keyword: #pfreq=noraman
keyword: PBEPBE/SDD
title: #p freq=noraman PBEPBE/SDD
converged: YES YES NO NO
title: Mulliken charges:
elementType: O O O C C C C C C C C C C C C C C C C C C C C C H H H H H H H H H H H H H H H H H H
charge: -0.286470 -0.453839 -0.244738 -0.359386 0.401571 0.497317 -0.395586 -0.419208 -0.444689 -0.347509 0.317870 0.439424 -0.395221 -0.384973 0.081159 -0.230169 -0.225142 -0.334779 -0.239529 -0.811424 -0.294020 -0.227210 -0.248039 0.116125 0.227698 0.224855 0.331882 0.230868 0.261489 0.226418 0.229558 0.226854 0.227311 0.262409 0.229661 0.222181 0.234048 0.225357 0.283301 0.230011 0.234377 0.380191
chargesum: 0.00000
title: Mulliken charges with hydrogens summed into heavy atoms:
elementType: O O O C C C C C C C C C C C C C C C C C C C C C
charge: -0.286470 -0.073648 -0.244738 -0.131688 0.401571 0.497317 -0.170731 -0.087326 -0.213821 -0.086020 0.317870 0.439424 -0.168803 -0.155416 0.081159 -0.003315 0.002169 -0.072371 -0.009868 -0.129839 -0.010719 0.002801 -0.013663 0.116125
polarizability: 2.76892147e+02 1.18375344e+01 2.58215660e+02 -3.50985989e+00 -3.41096876e+01 1.71210247e+02
1716.lowfreq: -25.5055 -8.3360 -5.4758 -2.3371 -0.0006 -0.0005 -0.0003 12.2709 25.0940
frequency: -25.3737 10.2108 25.0378 30.1803 40.4088 47.0053 59.3469 61.8356 112.8184 132.1320 160.7989 180.0045 190.0997 229.9256 247.5599 268.5659 292.9086 316.8993 360.8156 377.2760 401.6760 406.3874 423.6366 437.3376 487.1510 497.1644 518.6645 533.3147 573.4261 581.3939 588.0343 607.4497 615.0346 629.5672 641.2681 681.7643 705.1567 713.3272 725.1649 752.7169 758.6663 770.7017 787.0609 794.1465 819.8206 839.5245 855.9125 857.6959 866.5677 874.0213 928.3938 952.7756 955.5370 963.1213 979.3642 982.1948 987.6948 989.9008 992.0869 998.4835 1014.6621 1016.3026 1025.1885 1047.0308 1048.5646 1082.6354 1116.8887 1129.7534 1160.7544 1173.2086 1178.1103 1183.7385 1186.9852 1197.5990 1208.8105 1224.2260 1234.1114 1261.7804 1274.7817 1297.7933 1303.7935 1321.0397 1333.0151 1374.8555 1385.7289 1386.1629 1395.7304 1406.7762 1430.3254 1442.0258 1471.6615 1472.4297 1477.5245 1480.6024 1508.5679 1578.7473 1584.3069 1594.8909 1603.0736 1611.3554 1625.0646 1641.7235 2961.5779 2972.9695 3053.9383 3082.6301 3103.5892 3109.6479 3121.3477 3127.7658 3134.6587 3136.4194 3138.9803 3150.9923 3159.8676 3160.3800 3165.2770 3184.6657 3189.6006 3532.1211
redmass: 1.0369 4.8935 5.4647 5.3372 3.8665 5.1128 6.2897 5.4936 4.0537 4.3864 6.1746 5.2741 5.6521 4.7104 4.5345 5.4037 5.9825 4.2479 3.0955 8.7560 2.8266 2.9016 3.0712 5.2526 3.1506 5.1715 3.3453 4.7198 4.3482 1.2282 5.1899 6.1548 6.3059 5.7256 6.5560 3.5566 1.8279 4.1914 3.6536 2.3027 1.8722 2.2890 3.1150 2.1122 6.0044 2.1716 1.3082 1.5197 1.7993 1.9202 1.5379 1.3847 5.8129 1.3803 1.4892 3.7412 1.5388 5.8724 1.3542 1.3204 2.7232 1.3559 2.2179 1.5634 2.2952 1.6042 1.8538 1.3244 1.6697 1.0690 1.0862 2.2736 1.2166 1.2661 1.9108 2.7314 3.3135 1.6624 1.6904 1.4380 2.2062 1.2931 1.2622 4.7970 7.4099 9.3379 1.2266 2.8970 2.2853 2.1627 1.0772 1.0713 2.4915 2.2608 2.5888 6.9530 6.1773 6.1373 6.3592 6.0386 6.2518 8.3059 1.0835 1.0385 1.0950 1.0997 1.0885 1.0868 1.0902 1.0859 1.0964 1.0873 1.0910 1.0957 1.0926 1.0958 1.1013 1.0929 1.0967 1.0641
irintensity: 0.4647 0.1218 0.1853 0.8149 0.4558 0.1170 0.2023 1.0278 0.2164 0.1533 0.3021 5.6474 0.2374 1.6741 0.0690 0.7318 1.9770 1.0136 0.1479 5.0999 0.5589 0.6618 11.6653 1.7211 10.9240 9.1170 2.2731 15.5121 13.0344 99.1344 37.7765 19.2949 3.3790 14.2838 5.7117 54.2585 52.9524 0.9035 5.6980 43.2597 80.6355 4.1106 13.5990 52.3479 11.7140 2.6139 0.5761 0.9732 9.7947 8.6528 15.7358 2.0220 187.5744 3.9904 33.2772 231.8493 4.0203 0.3683 0.7715 0.1840 3.6146 4.2368 4.8280 19.7920 18.5975 9.9405 66.7607 14.9375 119.1647 0.4013 3.9985 17.6974 0.4096 17.1728 2.1642 2.0979 213.7442 7.4735 69.4468 5.0833 69.5065 1.6590 3.6614 1.0871 1.1801 5.4174 9.1484 2.9125 39.4175 14.2728 13.6292 16.6626 135.7062 14.0323 50.4786 55.2291 3.2198 3.6747 11.8153 2.0051 5.4432 384.6814 21.6275 44.7955 23.7740 17.9305 12.6151 13.7941 26.3759 0.0954 16.5030 5.2315 16.7844 24.5660 24.6978 21.0356 23.5553 6.8995 6.7137 45.0592
temp: 298.150 k
press: 1.00000 atm
elementType: 8 8 8 6 6 6 6 6 6 6 6 6 6 6 6 6 6 6 6 6 6 6 6 6 1 1 1 1 1 1 1 1 1 1 1 1 1 1 1 1 1 1
symmnumber: 1
zpe: 864875.5 jmol-1
zpe.correction: 0.329414 hartree
zpe.thermalcorrener: 0.349791 hartree
zpe.thermalcorrenthalpy: 0.350735 hartree
zpe.thermalcorrgfe: 0.276693 hartree
zpe.sumelectzpe: -1035.034180 hartree
zpe.sumelectthermal: -1035.013803 hartree
zpe.sumelectthermalent: -1035.012859 hartree
zpe.sumelectthermalfe: -1035.086900 hartree
dipole: 0.4380 2.1629 -0.9108
dipole: 2.3874
quadrupole: -126.9368 -124.8821 -132.8706
quadrupole: 0.6984 0.3705 -7.4683
quadrupole: 1.2930 3.3478 -4.6408 0.6984 0.3705 -7.4683
hfenergy: -1035.3635937 hartree
pointgroup: C01 [X(C21H18O3)]
dipole: -0.1135696 -0.7960839 0.4853567 debye
polarizability: 258.7696055|-23.4937501|261.2581969|-23.3801|-39.8157525|186.2902519 unknown
InChI: InChI=1S/C21H18O3/c1-15-11-13-17(14-12-15)20(16-7-3-2-4-8-16)24-19-10-6-5-9-18(19)21(22)23/h2-14,20,22H,1H3
charge 0 multiplicity 1
42 atoms
O  0.796484 0.290137 0.101408
O  4.258241 1.373025 -2.099144
O  2.02079 1.841969 -1.759223
C  -0.429497 -0.059874 0.860104
C  -1.359328 1.148909 0.710329
C  -1.058768 -1.351014 0.330713
C  -2.551456 1.194818 1.473104
C  -1.06993 2.207522 -0.183708
C  -1.52027 -2.343819 1.227207
C  -1.224053 -1.541486 -1.063671
C  1.968058 -0.434288 0.257874
C  -3.164948 3.352317 0.457117
C  -3.441116 2.282133 1.347348
C  -1.970147 3.290321 -0.30337
C  3.098079 -0.008267 -0.518592
C  -2.147283 -3.513868 0.740636
C  -1.839277 -2.713564 -1.550903
C  2.099927 -1.534603 1.145243
C  -2.306588 -3.701803 -0.650934
C  -4.107348 4.538624 0.342808
C  4.330352 -0.702278 -0.365958
C  3.334428 -2.200381 1.272443
C  4.458454 -1.786974 0.519788
C  3.011861 1.127719 -1.470301
H  -0.166449 -0.189751 1.931552
H  -2.797784 0.372997 2.157326
H  -0.144824 2.17956 -0.767734
H  -1.392441 -2.204207 2.309278
H  -0.864767 -0.771848 -1.755781
H  -4.361699 2.29965 1.943809
H  -1.735596 4.103742 -1.001388
H  -2.503701 -4.276166 1.442487
H  -1.959765 -2.857228 -2.630516
H  1.239875 -1.887233 1.717605
H  -2.7878 -4.609514 -1.031882
H  -5.149117 4.253474 0.573483
H  -3.82241 5.343062 1.048977
H  -4.08832 4.9733 -0.672304
H  5.182248 -0.365371 -0.961357
H  3.414726 -3.049585 1.960311
H  5.416268 -2.306377 0.620697
H  4.133592 2.13982 -2.719882
