program: Gaussian 09
title: 000155869
version: EM64L-G09RevD.01
frameworkgroup: C1[X(C8H19O2PS2)]
method: RPBEPBE
basis: SDD
operation: Freq
keyword: #p
keyword: freq=noraman
keyword: PBEPBE/SDD
title: #p freq=noraman PBEPBE/SDD
converged: YES YES NO NO
title: Mulliken charges:
elementType: S S P O O C C C C C C C C H H H H H H H H H H H H H H H H H H H
charge: 0.011272 0.006008 0.747303 -0.645610 -0.589054 -0.310269 -0.263128 -0.644933 -0.735279 -0.341024 -0.339477 -0.684265 -0.688180 0.213240 0.213383 0.223370 0.207054 0.288086 0.277509 0.306915 0.271937 0.199318 0.199545 0.191456 0.205149 0.220462 0.212370 0.212483 0.217587 0.210428 0.215672 0.390672
chargesum: 0.00000
title: Mulliken charges with hydrogens summed into heavy atoms:
elementType: S S P O O C C C C C C C C
charge: 0.011272 0.006008 0.747303 -0.254938 -0.589054 0.116354 0.167296 -0.079338 -0.156427 0.057838 0.057128 -0.038950 -0.044493
polarizability: 2.31963889e+02 9.37475111e+00 1.44775225e+02 2.86186784e+00 -7.68125022e-01 1.29677312e+02
1716.lowfreq: -8.8917 -7.5682 -5.7491 -0.0017 0.0002 0.0028 6.5492 21.8700 26.8864
frequency: -4.2761 21.7191 26.4277 44.2481 47.3742 61.3796 93.6170 102.3542 111.7299 114.7798 147.1366 150.7907 159.0898 185.1127 213.7222 227.4714 234.2974 244.9385 281.2418 297.6495 315.5739 336.7457 377.3885 380.2494 416.0515 459.0364 658.4571 667.3704 674.6196 730.7061 739.4533 772.4678 787.0620 891.2331 891.9824 908.3483 915.4524 983.8070 1021.8876 1025.0075 1027.8286 1066.5871 1069.2602 1072.7131 1080.5477 1098.5978 1103.1751 1203.4413 1206.9327 1238.3132 1246.2114 1271.8584 1277.6324 1291.9313 1292.3194 1303.8583 1307.4197 1343.9944 1346.3567 1389.9381 1390.5374 1429.7620 1454.5369 1465.8428 1468.4692 1474.8137 1475.7882 1476.0981 1477.5788 1486.6311 1487.2494 2969.6561 2973.8602 2975.9729 2977.2906 2987.1255 2987.4098 3014.5941 3016.1915 3017.9108 3032.7979 3047.2001 3048.1748 3073.8952 3075.7007 3075.7674 3077.9218 3094.5428 3117.0428 3550.7827
redmass: 4.3750 4.7638 4.1751 2.1166 3.9602 1.7982 2.6482 3.0276 2.9754 2.2634 3.9580 3.3712 5.3382 3.1524 3.5197 1.2091 1.1119 3.6175 5.6407 4.1418 2.5680 5.9656 4.1705 2.8697 4.8922 19.1668 7.1687 9.1191 7.3127 1.0787 1.0688 1.1709 1.1418 1.8309 1.8164 1.2215 1.1976 2.5584 2.1085 3.2539 3.8651 1.1656 2.5845 2.2879 1.2937 2.1845 2.2602 1.5045 1.4517 1.2043 1.2145 1.2063 1.2018 1.0629 1.0621 1.2979 1.2728 1.4781 1.5107 1.2088 1.2081 1.0872 1.0865 1.0773 1.0718 1.0563 1.0474 1.0620 1.0423 1.0779 1.0818 1.0587 1.0559 1.0368 1.0390 1.0590 1.0597 1.0925 1.0645 1.1005 1.0566 1.1035 1.1037 1.1009 1.0999 1.1012 1.0995 1.1071 1.1098 1.0658
irintensity: 0.3477 0.6239 0.3862 0.5414 0.4646 0.9375 1.0512 0.7651 0.4850 0.7023 2.8092 3.6793 4.4012 1.9777 10.1162 1.4170 0.2173 34.5370 1.0985 23.7545 44.0645 4.6901 27.5939 0.1397 13.3890 221.4880 89.1527 57.8086 63.7111 10.0094 11.7169 0.3138 0.0419 2.0423 5.8217 4.0229 2.6318 23.1213 96.1928 29.7464 5.4360 0.0540 0.5403 1.5454 3.7465 41.2121 10.1919 0.3517 2.0654 3.7909 8.9556 0.1943 0.3844 0.6608 0.6380 16.9304 11.6762 10.7375 3.3730 9.1460 8.0585 14.3978 8.6958 1.1490 1.7197 6.1613 10.3551 4.8118 13.2837 13.9376 16.7073 28.0160 20.2270 29.6222 33.5203 36.0608 25.3427 6.7045 15.3793 2.2221 14.3876 17.4467 15.7906 61.2553 79.5731 49.5372 45.9762 7.7759 15.7926 56.5796
temp: 298.150 k
press: 1.00000 atm
elementType: 16 16 15 8 8 6 6 6 6 6 6 6 6 1 1 1 1 1 1 1 1 1 1 1 1 1 1 1 1 1 1 1
symmnumber: 1
zpe: 688798.1 jmol-1
zpe.correction: 0.262349 hartree
zpe.thermalcorrener: 0.281261 hartree
zpe.thermalcorrenthalpy: 0.282205 hartree
zpe.thermalcorrgfe: 0.212187 hartree
zpe.sumelectzpe: -1602.957269 hartree
zpe.sumelectthermal: -1602.938357 hartree
zpe.sumelectthermalent: -1602.937413 hartree
zpe.sumelectthermalfe: -1603.007431 hartree
dipole: 0.7076 0.4622 0.6590
dipole: 1.0718
quadrupole: -86.2199 -100.7901 -111.2054
quadrupole: 0.5592 1.8352 -5.1460
quadrupole: 13.1852 -1.3850 -11.8003 0.5592 1.8352 -5.1460
hfenergy: -1603.219618 hartree
pointgroup: C01 [X(C8H19O2P1S2)]
dipole: 0.2545737 -0.1001614 0.3208729 debye
polarizability: 228.4461121|8.2754168|135.6173262|17.9516453|8.6920307|142.3529874 unknown
InChI: InChI=1S/C4H10O2PS.C4H9S/c1-2-3-4-8-7(5)6;1-2-3-4-5/h5H,2-4H2,1H3;2-4H2,1H3
charge 0 multiplicity 1
32 atoms
S  0.898743 0.498425 -1.153004
S  -2.135903 -0.557373 -2.811358
P  -0.360233 -1.331044 -1.58788
O  0.6922 -2.100231 -2.75156
O  -0.788307 -2.282002 -0.374275
C  3.402721 0.683671 0.108147
C  -3.528738 0.260726 -0.42181
C  2.428088 -0.386088 -0.412253
C  -3.447354 -0.869276 -1.456357
C  4.678102 0.035748 0.705532
C  -4.646284 -0.002631 0.617605
C  5.669453 1.090774 1.242904
C  -4.739829 1.122909 1.670703
H  3.690996 1.365356 -0.716055
H  2.905967 1.300992 0.8818
H  -2.557475 0.353963 0.102288
H  -3.713667 1.226186 -0.931655
H  2.870833 -0.99282 -1.217809
H  2.072128 -1.040303 0.400878
H  -3.192628 -1.834945 -0.986192
H  -4.385832 -0.979638 -2.028795
H  4.389883 -0.655768 1.522402
H  5.174474 -0.580561 -0.070452
H  -5.620193 -0.10452 0.096542
H  -4.455331 -0.969731 1.12435
H  6.572051 0.612902 1.665142
H  5.205553 1.701992 2.039383
H  5.994426 1.776277 0.438079
H  -5.539795 0.919357 2.405785
H  -4.957521 2.096884 1.19361
H  -3.788396 1.225238 2.225117
H  0.445171 -3.043372 -2.94611
