program: Gaussian 09
title: 000014065
version: EM64L-G09RevD.01
frameworkgroup: C1[X(C8H13ClO3)]
method: RPBEPBE
basis: SDD
operation: Freq
keyword: #p
keyword: freq=noraman
keyword: PBEPBE/SDD
title: #p freq=noraman PBEPBE/SDD
converged: NO YES NO NO
title: Mulliken charges:
elementType: Cl O O O C C C C C C C C H H H H H H H H H H H H H
charge: -0.101917 -0.265048 -0.240506 -0.091895 -0.362613 -0.366199 -0.515013 -0.397496 0.241156 -0.041695 -0.227243 -0.671696 0.216679 0.219549 0.218097 0.218248 0.247422 0.248204 0.270378 0.270277 0.229027 0.228660 0.212993 0.230347 0.230286
chargesum: 0.00000
title: Mulliken charges with hydrogens summed into heavy atoms:
elementType: Cl O O O C C C C C C C C
charge: -0.101917 -0.265048 -0.240506 -0.091895 0.073614 0.070145 -0.019387 0.143160 0.241156 -0.041695 0.230444 0.001930
polarizability: 1.48907124e+02 1.11014404e+01 1.01232547e+02 -9.87381961e-02 -3.37373277e-01 6.97264664e+01
1716.lowfreq: -15.1516 -3.4255 -0.0032 -0.0018 0.0006 4.1990 15.4143 30.2831 43.2778
frequency: -5.8818 30.2772 43.1308 48.9185 53.8649 96.3910 116.8725 124.5710 152.8165 171.0598 211.4082 249.9098 313.9554 345.6774 385.9869 391.8479 464.2955 470.3295 548.9107 672.9019 713.9246 723.2479 777.4672 797.3740 812.3092 895.0667 905.4760 951.0044 1019.8353 1047.9106 1057.1325 1079.6521 1090.0532 1113.5581 1130.8450 1135.1277 1136.1150 1229.8091 1240.2250 1247.9159 1285.9372 1292.3976 1299.4149 1346.2343 1359.2212 1373.4267 1401.0235 1426.3579 1442.5152 1463.9367 1467.0589 1473.7181 1482.0134 1486.3150 1639.0170 1756.6789 2988.6964 2990.2079 2996.2193 2997.5365 3002.6901 3012.1184 3027.8789 3036.3371 3051.9079 3070.7279 3072.3197 3093.8405 3109.7620
redmass: 4.8222 4.4794 5.1412 3.2916 2.2982 2.3147 5.5223 2.0213 2.0144 8.8799 5.2471 1.2786 5.7639 3.6307 5.5338 9.9061 2.8616 3.6605 2.6603 6.8300 6.4545 1.1264 1.4027 1.1011 3.6054 1.5184 6.5550 4.5830 2.2744 3.4203 3.3864 1.7735 2.7351 2.2884 1.3446 1.7902 1.9453 1.2886 1.3729 1.1355 1.1344 1.0565 1.5112 1.4444 1.4876 1.7126 1.2694 1.0774 1.0863 1.0402 1.0754 1.0595 1.0951 1.0698 9.7033 10.9521 1.0612 1.0611 1.0607 1.0360 1.0591 1.0582 1.0982 1.0988 1.1014 1.1066 1.1036 1.0984 1.1026
irintensity: 0.8554 3.0978 0.8893 0.1982 0.7422 3.5850 3.9382 0.8620 6.7119 0.5160 5.9328 1.5975 9.1361 1.1785 61.0229 5.5376 0.0680 2.6155 1.4771 33.4141 98.3027 15.9516 0.1823 4.2066 5.1938 4.5606 1.3978 156.3023 40.0882 57.1258 51.5967 0.1132 22.9973 8.1019 45.8849 100.9111 137.5364 0.2037 126.0173 0.0366 0.3667 0.1965 10.3887 32.1329 8.5981 12.9525 18.3575 37.9346 17.7854 12.2352 0.1038 5.1905 20.1477 15.4993 169.5920 239.6722 1.6889 5.9863 2.7163 20.7467 43.6009 20.0400 0.6302 0.0087 0.1971 2.6966 67.4467 29.4768 45.4034
temp: 298.150 k
press: 1.00000 atm
elementType: 17 8 8 8 6 6 6 6 6 6 6 6 1 1 1 1 1 1 1 1 1 1 1 1 1
symmnumber: 1
zpe: 523023.4 jmol-1
zpe.correction: 0.199209 hartree
zpe.thermalcorrener: 0.213058 hartree
zpe.thermalcorrenthalpy: 0.214002 hartree
zpe.thermalcorrgfe: 0.155748 hartree
zpe.sumelectzpe: -997.442068 hartree
zpe.sumelectthermal: -997.428219 hartree
zpe.sumelectthermalent: -997.427275 hartree
zpe.sumelectthermalfe: -997.485529 hartree
dipole: 4.4364 0.3186 0.0747
dipole: 4.4485
quadrupole: -88.3212 -88.0537 -75.6079
quadrupole: 7.6010 0.0574 -0.0891
quadrupole: -4.3269 -4.0595 8.3864 7.6010 0.0574 -0.0891
hfenergy: -997.6412769 hartree
pointgroup: C01 [X(C8H13Cl1O3)]
dipole: 1.7380047 -0.2024357 -0.0375952 debye
dipolederiv: -0.9600583 0.4038815 -0.0168797 0.4987917 -0.5460912 0.0172014 -0.0219735 0.0176776 -0.1658988 -1.7408436 0.3438181 0.0240007 0.373453 -0.6061309 -0.0093601 0.0286381 -0.0090559 -0.2820621 -0.7299682 -0.0826303 0.003607 0.2845015 -0.92151 -0.0098747 0.0103922 -0.0038254 -0.295038 -0.5599066 -0.0619066 0.0050476 0.2829076 -1.1118418 0.0454075 -0.0130538 0.0472031 -0.2003678 0.0291515 0.0165989 0.0005054 0.0507354 0.0460915 0.0028281 -0.0046813 0.0007696 0.1576613 -0.0173013 0.0086371 0.0002089 -0.0810439 0.0845312 0.0048125 0.0055461 0.0053405 0.1779758 -0.2865019 -0.089553 0.0063486 -0.2862423 -0.0934063 0.0056329 0.0190402 0.0067897 0.1449119 -0.2818329 -0.0836895 0.0053677 -0.1761778 -0.1723167 0.0151092 0.0076254 0.0136973 0.1195534 1.7455378 -0.1485096 -0.0264184 -0.5486458 1.2552443 0.0168529 -0.0408681 0.0095915 0.1737076 1.61591 -0.2883244 0.0082061 -0.7117453 1.6238866 -0.0724605 0.0310787 -0.0744032 0.1395984 0.9151864 -0.0673182 -0.0086613 0.1261277 0.2293484 -0.0022754 -0.0067324 0.0004901 0.3507224 -0.1061688 0.0858162 0.0041486 0.063319 -0.0022344 -0.0030872 0.0041351 -0.0031999 0.0605729 0.0509427 0.0081297 -0.011537 0.0147839 0.0011731 0.0971857 -0.0036927 0.1041279 -0.0712841 0.0569965 0.0072349 0.0097206 0.0155019 -0.0132281 -0.0997637 0.0022039 -0.105724 -0.0507085 0.0518744 0.0010752 -0.0029176 0.0124079 -0.0014782 0.0975531 0.0071677 0.1030096 -0.0701187 0.0508378 0.0005183 0.0019314 0.0102996 -0.0191379 -0.1018892 -0.0098413 -0.1076127 -0.0528101 0.0476792 -0.0110095 -0.0015602 0.0372339 0.037811 0.0805331 -0.0118506 0.1018792 -0.0250746 0.0486803 -0.0078998 0.003479 0.0416242 0.0254361 -0.0844411 0.0062799 -0.1062113 -0.0114903 0.0457747 0.0022527 0.0071792 0.0630372 0.0579135 -0.0714505 0.0183156 -0.0864262 0.022227 0.0453489 0.0031924 -0.0079482 0.0623838 0.0712751 0.0664945 -0.0230332 0.0824679 0.0088209 -0.0467384 0.0332453 -0.0226138 -0.0582203 -0.0037947 0.0932198 0.0170573 0.1024949 -0.0566981 -0.0473421 0.0287323 0.022322 -0.0606022 0.0026535 -0.090026 -0.0197238 -0.1023635 -0.0647056 -0.151786 -0.0618493 0.0034903 -0.0855968 0.0424191 0.0004613 0.0032916 -0.0000596 0.1160431 0.1129763 -0.0186487 0.0336051 0.0374651 0.0028094 0.1022476 0.0058821 0.1186024 -0.0596909 0.1115514 -0.0217938 -0.0406321 0.0337013 0.0105777 -0.100911 -0.0112032 -0.1152597 -0.0658473 unknown
polarizability: 147.841733|-13.1530398|102.2736969|-0.2074045|-0.8752591|69.7507076 unknown
InChI: InChI=1S/C8H13ClO3/c1-2-12-8(11)6-4-3-5-7(9)10/h2-6H2,1H3
charge 0 multiplicity 1
25 atoms
Cl -5.694211 0.956703 -0.008964
O  3.297979 -0.487858 -0.021119
O  2.279244 1.60902 0.015955
O  -4.404857 -1.459962 0.109266
C  -0.356839 0.438118 -0.00701
C  -1.652971 -0.3984 0.034729
C  0.900653 -0.450605 0.024112
C  -2.900622 0.508437 0.002293
C  2.187854 0.359373 0.006027
C  -4.202687 -0.255104 0.046196
C  4.637743 0.184942 -0.033306
C  5.684728 -0.922299 -0.072498
H  -0.337509 1.065868 -0.918366
H  -0.327315 1.140319 0.847697
H  -1.674286 -1.02261 0.948654
H  -1.683293 -1.098122 -0.822454
H  0.911176 -1.090404 0.92846
H  0.918943 -1.148996 -0.834751
H  -2.905802 1.220584 0.851064
H  -2.917907 1.142886 -0.905576
H  4.682819 0.846769 -0.916861
H  4.715546 0.814189 0.87157
H  6.697224 -0.479476 -0.083499
H  5.601877 -1.575829 0.812429
H  5.568214 -1.543642 -0.976551
