program: Gaussian 09
title: 000155771
version: EM64L-G09RevD.01
frameworkgroup: C1[X(C11H16O2)]
method: RPBEPBE
basis: SDD
operation: Freq
keyword: #pfreq=noraman
keyword: PBEPBE/SDD
title: #p freq=noraman PBEPBE/SDD
converged: YES YES NO NO
title: Mulliken charges:
elementType: O O C C C C C C C C C C C H H H H H H H H H H H H H H H H
charge: -0.249960 -0.231118 -0.345032 -0.362942 -0.346626 -0.493609 -0.693885 0.182849 -0.197422 0.187082 -0.331456 -0.044668 -0.551068 0.183603 0.221649 0.210330 0.202050 0.190044 0.198128 0.236754 0.245289 0.214682 0.216186 0.208849 0.230923 0.241507 0.234379 0.222540 0.220942
chargesum: 0.00000
title: Mulliken charges with hydrogens summed into heavy atoms:
elementType: O O C C C C C C C C C C C
charge: -0.249960 -0.231118 0.060220 0.049438 0.041546 -0.011566 -0.054168 0.182849 -0.197422 0.187082 0.140974 0.189711 -0.107586
polarizability: 1.70635525e+02 1.93134756e+01 1.35188101e+02 6.82907942e+00 4.58028152e+00 8.81233302e+01
1716.lowfreq: -15.8403 -4.4783 -3.0713 0.0003 0.0004 0.0004 8.7094 20.6325 36.3570
frequency: -8.6162 20.3302 36.2924 48.4496 61.5796 77.4921 99.9364 116.9027 160.2994 174.9482 195.4791 229.9969 239.4406 305.0853 324.2386 376.4956 380.2641 387.7071 455.9149 549.7173 560.0354 638.0827 701.2082 728.2604 757.3124 793.3401 830.6441 864.2180 909.1447 912.7472 932.2664 958.2003 964.2510 979.2138 1007.9356 1020.5187 1054.2206 1081.3612 1105.4187 1107.7047 1149.7686 1198.4625 1212.6280 1213.1228 1218.3524 1266.6681 1281.1607 1284.0740 1290.1187 1313.7580 1334.5831 1338.6365 1358.6293 1389.7720 1433.8046 1446.1334 1463.9184 1464.6263 1468.0592 1477.3053 1478.6968 1488.1029 1595.3309 1665.7371 2267.1439 2959.4221 2966.9083 2970.8021 2973.7643 2982.0311 2998.2769 3002.2891 3020.1575 3026.3806 3050.8157 3067.2782 3070.3514 3073.4269 3093.7945 3121.9648 3204.0174
redmass: 3.9920 4.2634 4.1804 1.9093 2.6141 2.6329 3.3761 2.4845 3.1265 2.9966 3.2210 1.3930 2.3064 4.7460 3.6570 2.5773 4.1399 3.0362 2.8104 4.5580 3.4158 1.8670 11.8587 1.1215 2.2111 1.9017 1.6352 3.3672 1.8774 1.6869 1.5946 1.3950 1.6717 1.8651 1.5294 2.6983 3.1492 2.1752 1.7121 1.8860 1.6975 1.4131 2.2939 1.2438 1.7725 1.2675 1.2255 1.2468 1.0693 1.3690 1.3731 1.4453 1.5835 1.2151 1.1906 1.0869 1.0726 1.0979 1.0709 1.0424 1.0697 1.0836 12.2056 4.7557 11.8753 1.0599 1.0602 1.0593 1.0361 1.0617 1.0580 1.0965 1.0989 1.1009 1.1042 1.1050 1.1005 1.0996 1.0607 1.0950 1.1144
irintensity: 1.3813 0.1872 0.6814 0.3842 0.9011 2.4522 0.9155 0.7726 1.8428 0.3734 1.5178 0.5525 1.5502 8.9118 7.3842 1.1094 2.6562 0.6754 2.0326 3.1858 0.7529 11.0792 14.5285 13.7349 3.9416 1.8239 4.8774 9.5717 8.9978 16.2892 57.7113 69.5098 12.0402 27.9189 99.4948 126.1938 85.0116 23.8113 4.8431 5.8493 0.9843 1.5514 184.6806 3.7401 166.2373 0.3192 0.6854 1.4849 0.8264 21.5969 1.8235 14.0977 9.2745 11.5564 13.5620 13.9895 2.0460 9.3162 0.5914 12.3530 3.2456 17.8374 280.8131 5.1312 217.1115 2.5228 39.6384 22.1983 33.1500 62.7650 17.4883 3.8478 11.7747 14.4387 54.4761 13.0274 86.1861 58.6899 9.6915 9.0749 23.4989
temp: 298.150 k
press: 1.00000 atm
elementType: 8 8 6 6 6 6 6 6 6 6 6 6 6 1 1 1 1 1 1 1 1 1 1 1 1 1 1 1 1
symmnumber: 1
zpe: 632985.6 jmol-1
zpe.correction: 0.241091 hartree
zpe.thermalcorrener: 0.256124 hartree
zpe.thermalcorrenthalpy: 0.257068 hartree
zpe.thermalcorrgfe: 0.196139 hartree
zpe.sumelectzpe: -578.122757 hartree
zpe.sumelectthermal: -578.107725 hartree
zpe.sumelectthermalent: -578.106780 hartree
zpe.sumelectthermalfe: -578.167710 hartree
dipole: -2.2110 1.7217 0.0798
dipole: 2.8034
quadrupole: -68.6782 -82.7012 -76.9634
quadrupole: 14.0841 1.7732 -0.7127
quadrupole: 7.4361 -6.5869 -0.8491 14.0841 1.7732 -0.7127
hfenergy: -578.3638486 hartree
pointgroup: C01 [X(C11H16O2)]
dipole: 0.8512583 0.6975128 -0.0727646 debye
polarizability: 171.6239384|-17.8390144|133.4447068|8.2561664|-7.2411321|88.8783105 unknown
InChI: InChI=1S/C11H16O2/c1-3-5-6-7-8-9-11(12)13-10-4-2/h4H,2-3,5-7,10H2,1H3
charge 0 multiplicity 1
29 atoms
O  -1.990514 -0.025608 0.056354
O  -2.48266 -2.30002 0.328479
C  3.125362 0.544135 0.270447
C  3.271192 -0.819203 -0.438815
C  3.926028 1.668505 -0.425442
C  2.464144 -1.963949 0.24149
C  3.780087 3.0322 0.283616
C  1.010949 -1.740311 0.238534
C  -0.207291 -1.533463 0.221416
C  -1.638436 -1.375415 0.213237
C  -3.4678 0.247736 0.043491
C  -3.645122 1.724542 0.252726
C  -4.372474 2.52221 -0.567178
H  3.46347 0.450884 1.323907
H  2.054049 0.825375 0.307805
H  2.947188 -0.726859 -1.493659
H  4.3379 -1.119982 -0.455278
H  4.997852 1.384997 -0.468194
H  3.585258 1.759244 -1.47695
H  2.801891 -2.076638 1.292177
H  2.679556 -2.928035 -0.260713
H  2.721363 3.351449 0.311906
H  4.357715 3.820691 -0.232776
H  4.141416 2.977116 1.327909
H  -3.880664 -0.093714 -0.922421
H  -3.928818 -0.351924 0.851672
H  -3.164472 2.138387 1.149458
H  -4.511603 3.587271 -0.353244
H  -4.852467 2.133379 -1.473855
