program: Gaussian 09
title: 000155765
version: EM64L-G09RevD.01
frameworkgroup: C1[X(C18H19ClN2O11S)]
method: RPBEPBE
basis: SDD
operation: Freq
keyword: #p
keyword: freq=noraman
keyword: PBEPBE/SDD
title: #p freq=noraman PBEPBE/SDD
converged: YES YES NO NO
title: Mulliken charges:
elementType: Cl S O O O O O O O O O O O N N C C C C C C C C C C C C C C C C C C H H H H H H H H H H H H H H H H H H H
charge: 0.002485 0.956413 -0.234711 -0.311458 -0.465611 -0.442067 -0.441380 -0.403280 -0.207478 -0.270061 -0.223038 -0.626373 -0.490120 -0.405486 -0.698279 -0.162107 -0.222219 -0.093443 -0.122830 -0.037226 0.184237 0.270591 0.064896 0.338308 -0.255110 -0.022987 -0.302071 -0.162532 -0.463874 0.297861 -0.393511 -0.253375 -0.164102 0.252258 0.286788 0.237253 0.258494 0.288562 0.368732 0.377326 0.366737 0.301746 0.386547 0.279100 0.387973 0.245891 0.245591 0.350712 0.339193 0.264273 0.258329 0.264433
chargesum: 0.00000
title: Mulliken charges with hydrogens summed into heavy atoms:
elementType: Cl S O O O O O O O O O O O N N C C C C C C C C C C C C C C C C C C
charge: 0.002485 0.956413 -0.234711 -0.311458 -0.096879 -0.064741 -0.074643 -0.016733 -0.207478 -0.270061 -0.223038 -0.626373 -0.490120 -0.017513 -0.008374 0.090152 0.064569 0.143810 0.135664 0.251337 0.184237 0.270591 0.064896 0.338308 0.046636 -0.022987 -0.022971 -0.162532 0.027608 0.297861 -0.129238 0.004954 0.100332
polarizability: 3.50252198e+02 -2.81704475e+01 3.31313568e+02 1.50670390e+01 9.98382246e+00 2.14541588e+02
1716.lowfreq: -2.5857 -0.0005 0.0013 0.0019 3.6122 6.1027 16.5540 18.9237 25.1939
frequency: 16.2874 18.8872 25.1782 28.2696 36.0775 37.6371 48.5846 51.8403 58.6998 71.5844 84.4226 94.6341 99.4826 105.6914 119.2534 123.8860 134.6182 144.2131 146.3951 155.0121 191.9218 210.6983 212.6990 218.1723 223.6923 232.7541 238.2538 249.2810 274.9941 291.3364 302.4221 304.5985 310.6446 318.1385 348.7238 358.9323 373.7022 384.9276 395.7029 400.9871 409.8563 415.1973 436.8433 448.8365 466.4268 479.5932 503.1692 526.2467 537.6795 559.9402 580.8977 594.0805 608.3640 617.2436 624.4630 634.9525 639.1827 661.4212 672.2582 687.1401 705.2716 715.1227 717.4046 739.7299 749.6361 772.1235 782.1840 795.8953 823.2593 835.5134 848.4926 851.5873 870.3450 879.9092 882.4717 883.3455 905.1689 915.1960 919.3244 926.7824 950.7608 958.6943 961.5975 1005.6640 1020.4063 1022.5222 1030.7083 1047.4067 1049.4027 1058.7829 1066.4921 1072.7915 1079.9077 1085.3352 1111.8990 1115.4176 1136.0227 1181.9085 1183.3485 1199.1132 1224.8802 1225.1781 1228.2245 1242.1557 1247.1226 1261.2969 1264.0077 1283.0197 1294.8190 1309.1776 1312.8864 1322.1081 1350.0158 1358.8971 1365.7513 1374.5140 1384.2990 1393.8330 1397.5729 1399.4357 1422.6088 1441.2608 1467.5931 1488.3094 1501.4015 1529.0678 1576.5042 1595.7074 1601.0760 1628.5904 1677.3900 2960.1204 2979.9209 2996.7952 3010.7143 3045.0115 3063.1855 3106.8084 3183.1790 3201.5301 3221.6254 3236.5486 3271.0796 3294.1910 3373.7552 3378.3574 3511.9438 3548.4959 3549.0284 3552.0296
redmass: 7.6777 5.9344 6.1089 7.0798 8.6477 6.8123 9.0386 7.6304 7.8558 6.7509 7.5912 3.1365 7.3663 1.9043 6.8381 7.3262 10.9239 7.5242 5.5589 9.3370 7.2088 4.8106 5.8478 7.1160 7.4600 6.4829 5.9862 6.6163 4.1475 7.7346 6.2354 5.1932 4.5303 4.8490 4.9418 6.9509 7.8079 7.5049 2.2140 2.1859 1.2025 3.4742 8.1307 3.3789 3.6134 6.2273 6.8419 4.2818 4.1915 6.7789 5.2576 3.0509 1.5989 7.2695 5.2182 4.0898 5.1582 4.0191 1.2348 4.0538 4.5612 1.5001 3.5015 1.2877 4.6243 2.3352 3.7989 2.6460 1.5014 3.7217 4.7107 2.0040 5.7462 3.3705 5.8544 1.4355 5.9273 5.5670 5.4988 4.6553 1.4873 1.8855 5.2138 4.2190 1.4934 4.4649 4.8695 3.0694 4.5561 4.3531 2.7824 1.8055 2.6800 2.5061 2.1790 3.1674 1.5528 1.7709 1.2400 3.1960 1.1838 1.7688 1.3319 1.3091 1.2493 1.3188 1.2489 2.1106 1.2283 1.4384 1.4542 1.3082 1.4899 1.3704 2.4419 1.6617 1.4377 1.3504 2.8745 2.0206 3.4415 2.7564 1.1150 4.7766 5.5757 1.0856 5.2114 4.6341 6.5279 7.4420 9.1419 1.0589 1.0825 1.0844 1.1019 1.0846 1.0855 1.0891 1.0912 1.0891 1.0936 1.0982 1.1086 1.0698 1.0803 1.0411 1.0640 1.1012 1.0656 1.0657
irintensity: 0.2359 0.0559 1.1936 1.2328 1.8366 0.5408 0.1753 1.7886 1.0643 2.6636 1.5363 11.6450 0.6105 12.6048 1.5023 2.0288 5.3671 0.5724 0.6299 4.3139 2.7988 12.5338 0.8480 2.6215 5.9548 10.8742 2.3382 11.7912 2.2108 2.2349 5.9206 14.3625 7.7726 6.3685 6.6125 12.1770 14.3515 13.8864 60.2729 43.9651 114.4206 79.1313 60.0235 26.6726 157.2226 6.0732 4.1587 48.0414 15.1741 41.3756 67.9744 4.6207 51.2844 20.7368 0.2820 33.7457 7.3934 68.1020 97.5053 15.0845 19.0824 37.2801 39.9117 106.9146 25.1712 29.2024 131.4974 62.4898 54.2853 17.9042 103.1102 28.0591 12.8479 18.8744 46.6135 0.9033 23.9389 8.9428 139.1131 168.5362 7.8072 8.6961 231.1461 107.9623 40.3469 181.0398 58.7694 0.5884 6.4319 41.9120 70.3536 68.0234 208.0391 151.2610 24.7177 13.5214 15.6136 12.7449 38.7630 371.8416 9.6113 4.4841 17.7667 51.7077 14.6750 6.1011 9.3364 138.8291 18.6186 85.4438 22.4720 8.2928 21.5243 0.2714 1.2712 32.2147 25.7020 8.3871 32.2598 33.1311 51.9061 12.7172 63.6492 10.2162 114.3901 32.0653 328.0397 120.7397 11.1096 593.4264 201.7849 37.1952 8.5646 67.3990 16.6909 4.1110 32.1056 7.4739 1.4464 21.2804 3.7319 0.1199 0.1223 323.9939 136.8933 39.3942 27.6935 29.2633 22.9075 26.2000
temp: 298.150 k
press: 1.00000 atm
elementType: 17 16 8 8 8 8 8 8 8 8 8 8 8 7 7 6 6 6 6 6 6 6 6 6 6 6 6 6 6 6 6 6 6 1 1 1 1 1 1 1 1 1 1 1 1 1 1 1 1 1 1 1
symmnumber: 1
zpe: 963334.8 jmol-1
zpe.correction: 0.366915 hartree
zpe.thermalcorrener: 0.400230 hartree
zpe.thermalcorrenthalpy: 0.401174 hartree
zpe.thermalcorrgfe: 0.298465 hartree
zpe.sumelectzpe: -2489.725708 hartree
zpe.sumelectthermal: -2489.692393 hartree
zpe.sumelectthermalent: -2489.691449 hartree
zpe.sumelectthermalfe: -2489.794158 hartree
dipole: 6.5969 3.1001 -0.8044
dipole: 7.3333
quadrupole: -188.7308 -208.1461 -200.1056
quadrupole: -13.7902 18.7636 -11.5432
quadrupole: 10.2634 -9.1519 -1.1115 -13.7902 18.7636 -11.5432
hfenergy: -2490.0926227 hartree
pointgroup: C01[X(C18H19Cl1N2O11S1)]
dipole: 2.7519663 -0.8545047 0.143141 debye
polarizability: 341.2624663|32.4665148|331.7174612|-9.7332345|32.6641546|223.1274256 unknown
InChI: InChI=1S/C18H19ClN2O11S/c19-9-5-10(21-6-7-2-1-3-30-7)8(4-11(9)33(20,28)29)17(27)32-18-14(24)12(22)13(23)15(31-18)16(25)26/h1-5,12-15,18,21-25H,6,20H2
charge 0 multiplicity 1
52 atoms
Cl 1.951525 -4.533814 -1.113265
S  -1.358868 -3.66925 -0.580669
O  -2.410089 2.31307 -0.427203
O  -1.041345 1.040361 1.048759
O  -4.905576 0.44231 2.414542
O  -4.665554 -0.769492 -0.334704
O  -2.616424 1.952505 3.262623
O  -2.945019 0.954535 -3.314162
O  -4.709261 2.178331 -2.419409
O  1.01633 2.123937 0.715909
O  5.589368 1.762916 1.371614
O  -2.65565 -2.764806 -0.127417
O  -1.304709 -4.369441 -2.038434
N  3.097281 0.417372 0.060561
N  -1.233407 -4.93251 0.726763
C  -3.748972 0.588251 1.522402
C  -4.196661 0.563848 0.046708
C  -3.106288 1.934996 1.89222
C  -3.088681 1.068912 -0.915667
C  -1.933025 2.21095 0.94106
C  -3.69194 1.477341 -2.259812
C  0.309195 1.080289 0.692577
C  0.762305 -0.268531 0.292132
C  2.14258 -0.558242 -0.029564
C  -0.204606 -1.281533 0.15808
C  0.123844 -2.551292 -0.307609
C  2.467622 -1.89657 -0.44908
C  1.471287 -2.868397 -0.589091
C  4.529483 0.199171 -0.228009
C  5.341732 1.429032 0.018771
C  5.959244 2.35869 -0.802109
C  6.622016 3.319632 0.056628
C  6.373593 2.929113 1.360521
H  -3.02622 -0.230938 1.713078
H  -5.084977 1.211377 -0.0610
H  -3.859077 2.735921 1.730424
H  -2.328892 0.285556 -1.083949
H  -1.387792 3.144608 1.147878
H  -5.420165 -0.35267 2.119233
H  -3.920688 -1.445314 -0.322747
H  -3.35099 1.611759 3.836303
H  -1.242275 -1.062661 0.410274
H  -3.353618 1.223922 -4.181841
H  3.500628 -2.169559 -0.673984
H  2.771848 1.358222 0.332954
H  4.665725 -0.099274 -1.286692
H  4.910895 -0.630253 0.402538
H  -2.140984 -4.977607 1.217879
H  -0.929129 -5.82726 0.311382
H  5.940021 2.363089 -1.890391
H  7.201404 4.185124 -0.257285
H  6.645556 3.321671 2.336079
