program: Gaussian 09
title: 000155764
version: EM64L-G09RevD.01
frameworkgroup: C1[X(C20H28O2)]
method: RPBEPBE
basis: SDD
operation: Freq
keyword: #pfreq=noraman
keyword: PBEPBE/SDD
title: #p freq=noraman PBEPBE/SDD
converged: YES YES NO NO
title: Mulliken charges:
elementType: O O C C C C C C C C C C C C C C C C C C C C H H H H H H H H H H H H H H H H H H H H H H H H H H H H
charge: -0.439813 -0.429847 -0.081251 0.211830 0.336144 -0.462777 -0.150392 -0.550161 -0.505629 0.346884 -0.545891 -0.798009 -0.834931 -0.793887 0.062181 -0.592038 0.197875 0.088603 0.124389 -0.198960 -0.867920 -0.587047 0.189561 0.198304 0.221173 0.220948 0.214921 0.217857 0.225960 0.192148 0.209429 0.234284 0.227345 0.215256 0.235130 0.243185 0.229330 0.208299 0.209806 0.253846 0.208178 0.251573 0.332550 0.198511 0.216995 0.235944 0.275350 0.362908 0.214798 0.227056
chargesum: 0.00000
title: Mulliken charges with hydrogens summed into heavy atoms:
elementType: O O C C C C C C C C C C C C C C C C C C C C
charge: -0.107263 -0.066939 0.108310 0.211830 0.336144 -0.043300 0.070556 -0.117382 -0.087521 0.346884 -0.102178 -0.120277 -0.154116 -0.122057 0.062181 -0.340465 0.197875 0.088603 0.124389 -0.000449 -0.139631 -0.145194
polarizability: 2.87789456e+02 8.47357353e+00 2.27949857e+02 -1.66229269e+01 -3.93502442e+00 1.54652074e+02
1716.lowfreq: -11.2094 -9.2643 -0.0002 0.0001 0.0002 4.2141 34.1149 44.2344 86.4932
frequency: 33.7646 44.1001 86.4142 96.6536 106.1913 129.0447 139.5810 151.7442 170.5599 188.0243 212.9610 225.8770 233.1026 246.0701 257.7871 263.7729 267.4416 289.0357 290.6508 297.7956 303.8955 306.2810 324.0291 326.7121 337.2806 358.8767 376.9010 391.0984 416.9372 421.2679 430.7871 468.1767 488.5672 498.1055 507.2995 524.0071 547.9655 591.8825 627.9724 645.9513 663.1129 678.1113 696.8091 726.0146 749.0887 763.1463 818.5977 836.4992 848.6323 876.7070 879.1542 916.1599 927.7983 931.8863 938.2322 939.6512 974.2593 980.7486 982.3932 990.4558 996.9826 1015.8640 1017.7351 1027.5459 1039.1068 1039.4496 1060.8403 1091.2114 1098.6713 1111.2483 1130.3492 1145.0172 1153.9633 1169.0731 1170.5001 1192.0927 1202.7820 1212.5997 1219.7222 1235.7511 1241.9539 1251.0558 1276.4910 1284.3941 1303.4578 1308.5063 1321.8388 1326.9208 1337.7531 1339.9440 1353.5643 1358.5139 1369.7460 1372.1953 1374.1397 1384.8675 1391.1014 1398.0318 1404.8760 1438.3847 1448.3518 1459.1855 1461.6253 1465.2005 1466.6834 1472.2340 1475.5464 1480.2853 1485.3381 1488.1990 1491.0920 1498.2030 1502.0076 1576.2129 1613.3079 1635.5310 2915.7795 2948.4010 2954.4654 2971.2750 2973.2395 2975.8530 2982.9295 2987.6131 2992.3452 3005.9887 3007.4724 3013.3924 3038.5878 3044.5345 3050.3631 3064.9471 3068.8741 3076.7275 3079.9267 3082.4453 3084.2676 3098.7835 3100.2739 3101.7695 3167.5046 3200.7264 3551.3267 3582.7289
redmass: 3.5887 4.1155 3.1685 3.4506 2.4129 2.4861 1.6623 1.8508 2.0102 1.6365 2.7070 2.0506 2.2458 1.8434 1.4531 1.5049 2.8935 1.6590 2.4564 3.1813 2.0816 2.3051 1.2691 2.3583 2.5596 2.5281 2.7210 3.1413 2.7542 3.6221 3.7291 3.2586 3.2646 3.5825 2.7227 3.2271 2.5012 2.6734 3.4532 3.2150 4.1007 2.6091 3.4483 2.9370 3.0128 3.2345 2.4202 2.0759 2.3366 2.1478 1.6298 2.0043 1.9128 2.0466 1.5726 1.4251 1.6752 2.5115 2.0555 1.3284 1.3314 1.9202 1.7845 1.6946 1.7063 1.7907 2.0791 2.1878 2.4613 2.2552 1.6650 1.6809 1.3568 2.4227 2.5770 1.4460 1.9891 1.9162 1.9329 2.6279 1.7283 1.8401 1.5924 2.5762 1.5689 1.3946 1.3968 1.4079 1.5245 1.3819 1.5155 1.4330 3.4465 1.2526 1.2454 1.2850 1.5597 1.2116 1.6537 1.4346 1.5533 1.0713 1.1086 1.6247 1.0729 1.0814 1.1649 1.0674 1.0566 1.0746 1.0873 1.0628 1.0625 6.5595 6.5138 4.6894 1.0814 1.0418 1.0615 1.0363 1.0646 1.0603 1.0374 1.0703 1.0422 1.0827 1.0837 1.0975 1.0954 1.1012 1.1003 1.0987 1.0982 1.0976 1.0985 1.0984 1.0756 1.0818 1.0972 1.0838 1.0901 1.1149 1.0656 1.0651
irintensity: 0.2409 0.1493 0.4928 0.7022 0.3540 2.2569 0.4518 1.2886 0.8147 0.3761 0.8573 2.4482 1.8198 1.2620 8.5213 39.7548 0.8228 63.3243 11.7623 18.5508 0.8716 1.2290 78.3857 20.1451 4.5524 7.7452 10.5614 1.6913 4.3268 1.0870 2.5330 0.8260 4.5267 4.7812 3.0163 2.2574 0.3927 2.0645 5.5002 9.8685 3.2403 3.1968 4.7416 1.0482 2.6533 1.8293 10.2112 5.5928 10.2192 4.4643 13.7252 5.3810 14.0869 11.8747 9.6712 58.4732 6.5620 102.3147 0.8049 5.3124 39.9803 8.2300 13.3715 38.3639 6.9715 5.6108 12.1869 2.4225 15.0578 22.3421 15.2856 45.5764 86.7270 12.7739 2.7900 0.9728 19.4016 12.9890 7.8963 30.4263 17.6794 14.1379 10.2503 9.0508 2.5557 1.3028 0.3299 1.6464 1.4717 2.1731 2.8821 3.1750 39.5614 23.2570 14.4588 27.0860 31.2780 25.0208 2.4690 8.0323 19.4159 4.2292 12.8812 26.5527 2.7106 10.4728 6.5779 21.8818 14.8741 2.7726 29.1474 0.9051 16.6096 37.7407 31.8827 13.8979 21.5551 52.0080 29.6925 30.4951 15.1500 30.8098 22.0682 17.9665 34.6374 45.5995 26.5617 23.0296 34.7923 35.1788 47.7515 32.3934 55.8818 25.9466 15.1213 23.6502 19.2064 3.9143 58.3511 9.7875 4.5760 24.4399 7.3032 30.6718
temp: 298.150 k
press: 1.00000 atm
elementType: 8 8 6 6 6 6 6 6 6 6 6 6 6 6 6 6 6 6 6 6 6 6 1 1 1 1 1 1 1 1 1 1 1 1 1 1 1 1 1 1 1 1 1 1 1 1 1 1 1 1
symmnumber: 1
zpe: 1130780.9 jmol-1
zpe.correction: 0.430692 hartree
zpe.thermalcorrener: 0.453146 hartree
zpe.thermalcorrenthalpy: 0.454091 hartree
zpe.thermalcorrgfe: 0.382028 hartree
zpe.sumelectzpe: -927.675218 hartree
zpe.sumelectthermal: -927.652763 hartree
zpe.sumelectthermalent: -927.651819 hartree
zpe.sumelectthermalfe: -927.723882 hartree
dipole: 2.2050 1.0540 1.3957
dipole: 2.8144
quadrupole: -128.0836 -133.8438 -137.1382
quadrupole: 2.5144 -12.4795 0.3764
quadrupole: 4.9382 -0.8219 -4.1163 2.5144 -12.4795 0.3764
hfenergy: -928.1059094 hartree
pointgroup: C01 [X(C20H28O2)]
dipole: 0.8776031 -0.4119564 -0.5349639 debye
polarizability: 286.7631198|-9.1662396|228.2082474|19.6817435|-3.0109633|155.4200195 unknown
InChI: InChI=1S/C20H28O2/c1-6-13-12(2)16(21)11-15-14(13)7-8-17-19(3,4)18(22)9-10-20(15,17)5/h6,11,17-18,21-22H,1,7-10H2,2-5H3
charge 0 multiplicity 1
50 atoms
O  -5.152562 0.63247 0.938624
O  3.433115 2.849786 0.349684
C  -1.624015 -0.675954 0.007814
C  -0.923865 0.667026 -0.427687
C  -3.201051 -0.698663 0.042043
C  -1.515731 1.81941 0.445828
C  -3.677203 0.537319 0.878179
C  -0.997485 -1.858199 -0.75992
C  -3.058803 1.865212 0.412009
C  0.603871 0.519529 -0.184136
C  0.480244 -2.045678 -0.358631
C  -1.086529 1.038055 -1.93652
C  -3.880201 -0.711669 -1.356203
C  -3.67658 -1.972459 0.799922
C  1.264301 -0.743396 -0.196947
C  1.379016 1.686445 0.006712
C  2.684556 -0.812994 0.017767
C  2.76961 1.614182 0.182258
C  3.463471 0.374364 0.184632
C  3.319186 -2.159378 0.053365
C  4.980457 0.394707 0.296655
C  4.236802 -2.607935 0.953934
H  -1.328405 -0.804868 1.075982
H  -1.12638 2.798585 0.109897
H  -1.178965 1.684382 1.493923
H  -3.397313 0.363277 1.935589
H  -1.074792 -1.688871 -1.850296
H  -1.540878 -2.796806 -0.549495
H  -3.42512 2.673703 1.072343
H  -3.414336 2.108873 -0.610686
H  0.973201 -2.698345 -1.106402
H  0.52874 -2.606503 0.598203
H  -0.740692 0.227156 -2.600708
H  -2.128049 1.278359 -2.203965
H  -0.46785 1.926297 -2.159902
H  -3.408696 -1.463143 -2.013396
H  -4.94524 -0.991577 -1.254363
H  -3.831916 0.259392 -1.879032
H  -3.099831 -2.124996 1.732291
H  -4.741588 -1.858182 1.070042
H  -3.577269 -2.88361 0.182868
H  0.923943 2.679889 0.02446
H  -5.477838 0.946499 0.056363
H  2.979339 -2.872746 -0.71153
H  5.42114 1.17774 -0.354934
H  5.328859 0.583757 1.332296
H  5.417183 -0.564725 -0.018309
H  4.398496 2.71005 0.51261
H  4.635102 -3.627062 0.893949
H  4.591552 -1.989304 1.785922
