program: Gaussian 09
title: 000155763
version: EM64L-G09RevD.01
frameworkgroup: C1[X(C23H24N2O4)]
method: RPBEPBE
basis: SDD
operation: Freq
keyword: #p
keyword: freq=noraman
keyword: PBEPBE/SDD
title: #p freq=noraman PBEPBE/SDD
converged: YES YES NO NO
title: Mulliken charges:
elementType: O O O O N N C C C C C C C C C C C C C C C C C C C C C C C H H H H H H H H H H H H H H H H H H H H H H H H
charge: -0.301036 -0.449291 -0.337006 -0.436133 -0.480746 -0.319335 0.006766 0.181990 0.251796 0.211282 0.284802 -0.076668 -0.309303 -0.428294 -0.401850 -0.382174 -0.409981 -0.370652 -0.200713 -0.388856 -0.258612 -0.215742 -0.285435 0.266397 0.117480 -0.316705 -0.322588 -0.253373 -0.216798 0.198742 0.304415 0.244839 0.217881 0.220484 0.205154 0.235163 0.252366 0.245042 0.232032 0.293554 0.220668 0.219298 0.208825 0.221750 0.222586 0.227140 0.207248 0.341598 0.246946 0.249098 0.223483 0.226386 0.376079
chargesum: 0.00000
title: Mulliken charges with hydrogens summed into heavy atoms:
elementType: O O O O N N C C C C C C C C C C C C C C C C C C C C C C C
charge: -0.301036 -0.107693 -0.337006 -0.060053 -0.176332 -0.025781 0.006766 0.181990 0.251796 0.211282 0.284802 0.122074 0.153417 -0.002656 -0.166687 -0.129809 -0.164938 -0.138620 0.019955 0.039267 -0.036862 0.006844 0.148953 0.266397 0.117480 -0.069759 -0.073490 -0.029890 0.009588
polarizability: 2.64582966e+02 -1.58446796e+01 2.81233632e+02 -4.26177550e+01 2.96371296e+01 3.01094607e+02
1716.lowfreq: -7.3193 -4.9022 -3.6661 -0.0010 -0.0006 0.0002 2.5683 9.8172 14.7632
frequency: -3.5229 9.7786 14.6653 27.9290 36.6251 53.2233 68.2694 80.2329 102.8052 107.4325 120.2817 123.5199 155.7515 170.6761 185.9407 187.4787 191.6872 218.7807 228.5603 251.1112 258.6621 284.5623 303.7776 312.8547 328.3667 347.9639 365.0228 415.7152 435.1201 440.8896 442.6797 471.9998 493.9786 494.9361 505.8298 525.5603 534.2617 543.8796 551.6491 553.9776 564.4649 575.3119 589.7719 607.6045 628.5816 647.1938 708.3748 718.3615 720.4191 743.8685 749.7306 755.1004 758.3853 772.5690 783.9110 785.3664 819.9599 823.5754 834.7393 840.4072 846.2790 855.6556 856.8548 904.1110 909.8365 933.4057 936.3160 944.9850 958.9686 973.0654 981.8711 986.9562 1004.5820 1012.8828 1028.8822 1031.4800 1059.6078 1069.2823 1075.8903 1084.8269 1097.4975 1101.7384 1110.9572 1129.3229 1154.3928 1165.4158 1165.7241 1176.5070 1182.6684 1183.3142 1188.2807 1215.6156 1220.8178 1224.8889 1235.7820 1252.7152 1255.1652 1256.3225 1276.1874 1290.0221 1290.5479 1297.6897 1306.3800 1322.3859 1348.8916 1354.7847 1374.4407 1392.4917 1399.0669 1404.7318 1410.2912 1426.9188 1439.4585 1451.4512 1454.7962 1458.2198 1460.7312 1473.6078 1478.3451 1484.6602 1491.6933 1495.4871 1498.2938 1586.9836 1595.9905 1602.8350 1617.9414 1620.6857 1638.6317 2902.5172 2923.9500 2957.8340 2962.9587 2986.8505 3011.1055 3023.9974 3047.8627 3053.8494 3126.3305 3134.6286 3135.5724 3138.5523 3150.4807 3155.8752 3156.1448 3164.5842 3171.8634 3174.9316 3176.3136 3425.7361 3513.8676 3561.7049 3613.5087
redmass: 6.2227 5.5755 5.6186 5.3636 5.2462 5.4653 5.1086 5.1873 2.7100 4.9143 2.4153 3.9085 4.4569 3.2814 4.4237 3.9434 3.5903 4.3228 4.5910 4.0481 1.1765 5.0766 4.7277 4.7634 4.1914 4.7487 4.1167 6.1823 3.0111 3.2192 3.0096 4.6116 1.1366 1.1222 5.3614 4.3828 3.7361 5.8930 5.1589 3.8722 4.3240 3.5753 7.0603 4.8264 4.9421 6.2677 4.3551 2.4807 2.8292 1.2259 1.5576 1.8772 2.7390 1.9296 4.0198 4.2898 4.4613 1.3752 2.0644 1.4031 1.6268 3.1746 1.7590 3.8508 1.3688 2.1212 1.3933 1.3389 1.2888 1.3386 5.6319 7.3360 2.9427 2.1210 2.0359 1.9255 2.8186 2.7466 1.9241 2.2973 1.9949 2.2932 1.6194 1.8852 2.6257 1.0897 1.1194 1.2326 1.5559 1.2137 2.2227 2.2212 1.2933 1.4104 1.1630 2.0951 2.2433 1.4439 1.1516 1.2173 2.3868 2.6750 1.3815 1.3468 2.0475 1.4305 1.3319 1.5794 3.7949 1.5997 4.3468 3.0951 3.5002 1.9630 2.4037 1.2110 1.5203 1.1183 1.2349 3.4426 1.5852 1.3617 2.9253 6.6235 6.6182 7.1688 7.2757 6.3054 8.5606 1.0694 1.0655 1.0799 1.0585 1.0594 1.0953 1.0924 1.1035 1.1071 1.0854 1.0863 1.0851 1.0904 1.0902 1.0954 1.0945 1.0947 1.0978 1.0955 1.0995 1.0736 1.0644 1.0661 1.0802
irintensity: 0.0315 0.1079 0.4447 0.3895 0.9880 1.8022 0.3082 1.5041 5.4311 3.8748 2.1492 0.9155 1.3880 6.0211 2.1056 3.2088 3.1917 1.7327 0.2167 4.5675 147.6100 0.6048 1.7997 0.1396 5.1571 0.5342 8.6136 1.5177 8.5820 19.1222 10.7238 11.4521 101.8974 114.4530 7.1904 3.8073 5.5572 0.2990 1.5100 2.7915 2.3574 0.4302 6.9678 1.7343 7.9978 0.8994 0.5123 66.0576 26.8810 107.9333 107.4069 21.7324 27.5907 18.2591 39.3883 29.9416 9.1794 2.7620 11.0169 4.7800 2.0029 0.8437 0.7871 44.1910 4.2712 25.4184 4.4380 5.6146 0.0860 1.6387 67.4043 4.4795 18.8080 9.9634 36.8089 22.4072 67.0854 74.7620 26.7473 26.8699 23.2900 64.1855 2.0909 18.7896 70.6718 5.7251 19.5545 8.7515 103.5998 3.3156 176.0251 88.0549 55.6721 6.8506 5.6573 62.1710 109.1259 59.0763 4.1392 7.7293 19.1685 15.9091 16.8911 9.2910 73.5888 3.1086 2.7036 8.6998 2.4552 6.1483 19.5456 3.1148 98.5753 91.8170 22.3285 47.5705 3.0700 15.5074 55.5120 13.6535 87.8528 21.2489 25.1269 1.6236 64.6756 23.0066 74.1130 12.2927 18.3310 50.9056 62.1048 33.5819 33.0931 50.0756 81.2971 8.7346 66.4551 24.6574 0.4479 4.1334 0.5152 14.7975 21.6824 27.5882 27.5555 20.0211 18.6656 13.2306 9.4232 9.1470 69.5147 8.1102 54.4337
temp: 298.150 k
press: 1.00000 atm
elementType: 8 8 8 8 7 7 6 6 6 6 6 6 6 6 6 6 6 6 6 6 6 6 6 6 6 6 6 6 6 1 1 1 1 1 1 1 1 1 1 1 1 1 1 1 1 1 1 1 1 1 1 1 1
symmnumber: 1
zpe: 1115892.5 jmol-1
zpe.correction: 0.425021 hartree
zpe.thermalcorrener: 0.450590 hartree
zpe.thermalcorrenthalpy: 0.451534 hartree
zpe.thermalcorrgfe: 0.366767 hartree
zpe.sumelectzpe: -1299.130664 hartree
zpe.sumelectthermal: -1299.105095 hartree
zpe.sumelectthermalent: -1299.104151 hartree
zpe.sumelectthermalfe: -1299.188918 hartree
dipole: -2.4577 0.7322 1.8458
dipole: 3.1596
quadrupole: -192.2470 -150.1744 -156.9178
quadrupole: 17.5752 -6.0024 -6.1727
quadrupole: -25.8006 16.2720 9.5286 17.5752 -6.0024 -6.1727
hfenergy: -1299.5556854 hartree
pointgroup: C01 [X(C23H24N2O4)]
dipole: 1.0590058 0.0184315 0.6507121 debye
polarizability: 278.7578943|-9.8683991|268.2694495|51.9581574|-14.9494902|299.8838615 unknown
InChI: InChI=1S/C23H24N2O4/c26-16(14-24-12-13-28-21-10-4-3-9-20(21)27)15-29-22-11-5-8-19-23(22)17-6-1-2-7-18(17)25-19/h1-11,16,24-27H,12-15H2
charge 0 multiplicity 1
53 atoms
O  2.592935 -1.252962 0.006878
O  2.861046 -4.092447 -1.22009
O  -3.799981 -1.175208 -0.021354
O  -6.150846 -0.651501 -1.183164
N  3.580144 3.321041 -0.079805
N  -0.234139 -2.223978 -0.101201
C  3.177918 1.064048 0.06275
C  2.514798 1.566774 -1.131463
C  3.831503 2.175306 0.69262
C  2.784102 2.980468 -1.1872
C  3.272078 -0.215814 0.667619
C  1.861537 -3.574594 -0.267045
C  2.603365 -2.586203 0.636406
C  0.655384 -2.96266 -1.020734
C  4.574326 2.042505 1.887112
C  1.733184 0.970825 -2.151069
C  4.008024 -0.36987 1.865192
C  2.286611 3.798006 -2.222829
C  4.648993 0.754891 2.454896
C  -1.593263 -1.951994 -0.613772
C  1.231858 1.783763 -3.190099
C  1.503909 3.180396 -3.223257
C  -2.476725 -1.476656 0.54562
C  -4.811411 -0.732049 0.859529
C  -6.046429 -0.466006 0.200679
C  -4.687553 -0.548155 2.250027
C  -7.155556 -0.018662 0.939667
C  -5.8091 -0.096326 2.990195
C  -7.034267 0.165696 2.338307
H  1.496121 -4.396199 0.3866
H  3.924102 4.254571 0.131628
H  3.64245 -2.942922 0.765438
H  2.10259 -2.522181 1.622061
H  1.057698 -2.340175 -1.852414
H  0.072054 -3.787674 -1.476609
H  5.071223 2.896687 2.357429
H  1.541136 -0.105707 -2.132377
H  4.096952 -1.345028 2.350357
H  2.495838 4.872842 -2.257527
H  0.235341 -1.35854 0.203335
H  5.216113 0.609163 3.380957
H  -2.013179 -2.890968 -1.019845
H  -1.626886 -1.193568 -1.431184
H  0.628391 1.336556 -3.987583
H  1.102006 3.788288 -4.041627
H  -2.560399 -2.26962 1.313449
H  -2.060106 -0.561151 1.015324
H  2.418731 -4.707813 -1.858387
H  -3.741079 -0.749436 2.760888
H  -8.093801 0.179206 0.412899
H  -5.717419 0.048099 4.071693
H  -7.898823 0.51455 2.91262
H  -5.267899 -0.958813 -1.521538
