program: Gaussian 09
title: 000155758
version: EM64L-G09RevD.01
frameworkgroup: C1[X(C21H27N6S)]
method: RPBEPBE
basis: SDD
operation: Freq
keyword: #p
keyword: freq=noraman
keyword: PBEPBE/SDD
title: #p freq=noraman PBEPBE/SDD
converged: YES YES NO NO
title: Mulliken charges:
elementType: S N N N N N N C C C C C C C C C C C C C C C C C C C C C H H H H H H H H H H H H H H H H H H H H H H H H H H H
charge: 0.426851 -0.106220 -0.162103 -0.039936 -0.030707 0.023429 -0.414974 -0.365202 -0.498091 -0.553103 -0.554565 -0.541910 -0.390954 0.475614 -0.642065 -0.326443 -0.352755 -0.303519 -0.353283 0.128258 -0.443622 0.323434 0.098705 -0.355247 -0.331103 -0.222607 -0.221938 -0.225454 0.316979 0.272868 0.269079 0.250954 0.275908 0.266704 0.268504 0.276586 0.266260 0.271515 0.269866 0.266282 0.275285 0.210585 0.244092 0.239931 0.251643 0.213809 0.203828 0.244710 0.282581 0.272641 0.272711 0.271999 0.232747 0.235351 0.236096
chargesum: 1.00000
title: Mulliken charges with hydrogens summed into heavy atoms:
elementType: S N N N N N N C C C C C C C C C C C C C C C C C C C C C
charge: 0.426851 -0.106220 -0.162103 -0.039936 -0.030707 0.023429 -0.414974 0.224645 0.021941 0.258013 0.259796 0.269524 0.063722 0.475614 0.063317 -0.122616 -0.108045 -0.020938 -0.080642 0.128258 -0.443622 0.323434 0.098705 -0.082536 -0.059105 0.010140 0.013412 0.010643
polarizability: 7.08866469e+02 5.00683808e+01 3.12837678e+02 -9.56694717e+00 2.58188582e+01 1.53435987e+02
1716.lowfreq: -12.4938 -6.3425 -0.8454 -0.0008 0.0011 0.0016 7.1006 14.0437 27.1462
frequency: -6.0687 13.6197 26.9994 29.8684 35.3398 43.0228 52.3121 67.7289 78.7975 89.4245 96.8590 107.9928 126.8758 158.4689 165.6989 178.8802 193.1352 200.9611 224.1132 244.0845 246.5928 251.7924 272.4407 291.8787 301.0310 315.3081 341.3091 342.2719 356.1575 388.1081 403.9424 408.1349 418.7649 423.9931 433.7180 441.6127 462.0058 471.3427 488.9889 507.4917 531.9446 557.4029 599.7517 600.7517 614.4261 629.9020 645.5751 672.6273 695.9963 704.0252 708.3068 730.0267 741.0042 772.4266 780.1735 791.0915 793.1244 794.4128 831.0129 856.0818 856.8144 864.9648 894.6182 918.0787 929.4273 937.9604 952.3698 970.8886 977.4436 989.4038 989.7396 996.1671 998.3192 1009.0497 1020.3806 1023.9286 1039.7025 1045.0737 1048.7101 1078.6992 1080.5523 1100.0188 1110.3657 1112.0080 1126.8528 1145.0523 1171.6443 1175.1537 1181.6272 1185.7560 1210.0150 1215.0645 1219.6178 1245.2894 1246.3732 1260.7592 1285.4066 1307.4562 1315.9239 1321.5867 1325.5168 1334.6312 1343.3586 1371.9720 1373.2014 1381.9492 1386.5985 1389.9672 1397.1759 1422.2758 1424.0055 1424.9615 1439.6127 1444.4291 1447.4827 1452.3903 1461.1175 1464.4391 1468.4687 1469.5909 1479.0318 1483.6468 1485.6201 1490.8794 1493.9729 1496.7850 1499.9949 1513.2290 1556.3044 1587.8219 1613.1575 1615.8180 2987.0860 2992.0565 3002.6716 3023.6904 3025.6942 3027.4654 3030.1868 3053.4283 3065.5700 3089.1781 3101.9768 3104.5953 3129.1946 3132.2999 3140.2604 3140.7551 3143.6767 3144.8864 3146.0627 3149.6695 3152.4701 3156.6912 3159.4995 3163.3891 3166.5825 3174.4142 3181.0199
redmass: 5.2473 4.7234 4.3064 4.8331 3.0352 4.1465 3.6223 3.4055 3.1118 5.0114 3.7613 3.5288 4.4598 2.4538 2.9905 2.4877 4.0813 2.3410 1.6124 1.3608 3.1303 2.2436 1.1142 3.7203 9.1977 5.9985 2.3101 2.8522 4.3202 3.8985 2.8433 4.0801 4.2714 3.1330 2.4888 3.4297 2.9129 3.7734 4.3297 2.6829 3.3936 3.8308 6.0922 9.5431 6.6855 7.3846 9.3500 4.8399 5.0378 1.7759 8.3600 3.5190 4.0423 6.7389 1.2043 2.0610 1.2614 1.3485 1.5958 8.9247 3.3624 1.2453 2.5346 9.1431 2.6770 2.7501 1.4176 1.3858 1.3711 5.3282 3.0098 1.3820 2.7462 1.3306 2.9355 3.1029 4.5649 1.1964 1.4806 1.9312 1.6204 1.5200 1.4508 3.8451 1.4678 1.6443 1.4348 1.0560 1.7726 1.1235 1.9941 6.9462 1.8117 2.7464 1.8605 1.6325 1.3382 1.6104 2.0497 1.2448 1.9637 1.3371 1.3694 1.7722 3.1583 5.0757 3.9922 1.6737 1.2313 1.1850 3.6126 1.2977 1.2387 2.4618 2.8121 1.0487 1.1125 1.0472 1.0793 1.0445 1.0577 1.0569 1.0595 1.0856 2.4759 1.6788 1.3636 1.2057 6.7705 6.2935 6.0458 6.4207 1.0642 1.0367 1.0631 1.0335 1.0333 1.0462 1.0426 1.1006 1.0986 1.1001 1.1009 1.1082 1.0867 1.0855 1.1054 1.1057 1.0890 1.1051 1.1052 1.1059 1.1051 1.0934 1.0886 1.0945 1.0960 1.1008 1.0958
irintensity: 4.0231 3.6669 1.4755 1.9051 0.9666 0.0734 0.8685 0.2336 0.4164 0.7134 0.7364 0.6057 0.5338 0.4238 1.3805 0.5681 1.6314 1.7097 1.8577 0.4184 0.3080 1.5062 0.2566 1.8109 2.6556 1.3409 0.6337 0.7781 9.2463 8.5359 0.0048 3.3526 1.9443 0.5307 0.8361 18.9854 0.8433 2.6253 5.0139 11.3255 11.8876 14.4786 9.9636 5.2537 0.3419 2.6076 13.7073 6.1492 0.3090 81.1290 39.1843 2.5358 4.5280 12.3793 5.9038 40.8795 35.0486 7.1100 62.3705 0.1897 103.1938 0.0049 3.2145 3.1454 8.6461 19.9253 5.6613 4.9669 0.4554 0.6052 0.6408 0.0435 51.5911 0.4792 73.5790 1.7233 132.7879 0.0140 7.3535 45.2741 2.6604 20.1768 4.0645 5.6495 5.7001 16.9855 225.8591 0.0744 39.8605 37.9909 29.5559 16.5273 6.5812 8.1402 3.2612 180.6379 6.1774 95.8755 187.0337 35.8758 118.6753 2.8683 77.6244 107.0715 85.3392 193.3995 109.8662 77.7772 28.2926 12.5684 20.2235 27.7165 1.5648 22.5535 2.2909 0.3100 4.0236 1.8251 22.5135 9.6725 4.2983 37.5278 61.0733 22.0147 105.6476 101.3000 50.5134 79.9860 59.5755 3.3746 6.0196 532.2833 58.9703 21.9539 65.9904 1.4913 2.1054 7.2111 3.2845 3.7246 12.7199 30.0963 34.0402 6.9370 73.2504 0.1493 0.3148 0.3775 11.0901 1.4669 12.2649 3.5894 6.8573 20.3893 3.7402 14.3038 9.6642 26.3439 18.9737
temp: 298.150 k
press: 1.00000 atm
elementType: 16 7 7 7 7 7 7 6 6 6 6 6 6 6 6 6 6 6 6 6 6 6 6 6 6 6 6 6 1 1 1 1 1 1 1 1 1 1 1 1 1 1 1 1 1 1 1 1 1 1 1 1 1 1 1
symmnumber: 1
zpe: 1182109.5 jmol-1
zpe.correction: 0.450242 hartree
zpe.thermalcorrener: 0.477256 hartree
zpe.thermalcorrenthalpy: 0.478201 hartree
zpe.thermalcorrgfe: 0.390440 hartree
zpe.sumelectzpe: -1540.619828 hartree
zpe.sumelectthermal: -1540.592813 hartree
zpe.sumelectthermalent: -1540.591869 hartree
zpe.sumelectthermalfe: -1540.679629 hartree
dipole: 33.6710 -3.6626 1.8775
dipole: 33.9217
quadrupole: 71.6190 -135.5401 -169.3319
quadrupole: -46.0372 7.8703 -0.6598
quadrupole: 149.3700 -57.7892 -91.5809 -46.0372 7.8703 -0.6598
hfenergy: -1541.0700697 hartree
pointgroup: C01 [X(C21H27N6S1)]
dipole: -13.2383199 -0.9499217 -1.3982385 debye
polarizability: 708.100276|-51.5315703|314.8633598|-12.618685|23.4473952|152.1764982 unknown
InChI: InChI=1S/C21H27N6S/c1-5-26(15-16-27(2,3)4)19-13-11-18(12-14-19)23-24-21-22-20(25-28-21)17-9-7-6-8-10-17/h6-14H,5,15-16H2,1-4H3
charge 1 multiplicity 1
55 atoms
S  3.231084 -3.162049 0.050156
N  -6.768628 -1.780492 -0.851055
N  -4.671527 1.107982 0.655443
N  0.915077 0.048132 0.360622
N  1.295731 -1.21391 0.29135
N  3.700088 -0.561384 0.271627
N  4.922712 -2.601513 0.045117
C  -5.902485 -0.497035 -0.712982
C  -5.658133 0.027686 0.731027
C  -6.041833 -2.987197 -0.257231
C  -8.11688 -1.598727 -0.157629
C  -7.003144 -2.033611 -2.343007
C  -5.172878 2.50137 0.790989
C  -3.291567 0.81631 0.605371
C  -5.120867 3.037617 2.237998
C  -2.81828 -0.539973 0.586708
C  -2.316512 1.861458 0.561189
C  -1.452697 -0.83472 0.509806
C  -0.95005 1.560813 0.480293
C  -0.491572 0.215241 0.444625
C  2.678018 -1.409609 0.224821
C  6.196645 -0.496933 0.203776
C  4.921238 -1.237638 0.172056
C  6.184503 0.91708 0.340766
C  7.434731 -1.186672 0.100035
C  7.400142 1.631442 0.373705
C  8.644868 -0.46583 0.13352
C  8.632347 0.943817 0.27048
H  -4.933335 -0.726892 -1.187151
H  -6.409307 0.28247 -1.308112
H  -6.58968 0.435142 1.158487
H  -5.313821 -0.776733 1.408239
H  -5.074461 -3.109595 -0.767721
H  -5.882108 -2.830089 0.818922
H  -6.660215 -3.885315 -0.408992
H  -7.964122 -1.509543 0.927444
H  -8.747852 -2.475854 -0.368779
H  -8.600487 -0.689733 -0.546831
H  -7.569786 -1.190666 -2.76672
H  -7.5738 -2.967136 -2.465918
H  -6.029807 -2.12003 -2.84943
H  -6.216198 2.521189 0.423096
H  -4.60093 3.157844 0.111907
H  -5.500277 4.074448 2.273677
H  -4.089553 3.036606 2.629477
H  -5.742175 2.42442 2.915719
H  -3.518614 -1.378586 0.664511
H  -2.618187 2.910652 0.598741
H  -1.094777 -1.869194 0.505522
H  -0.201194 2.35842 0.446726
H  5.222212 1.432123 0.420037
H  7.430798 -2.276042 -0.004746
H  7.388259 2.721551 0.479981
H  9.598032 -0.999399 0.053594
H  9.575654 1.500389 0.296644
