program: Gaussian 09
title: 000014058
version: EM64L-G09RevD.01
frameworkgroup: C1[X(C9H20)]
method: RPBEPBE
basis: SDD
operation: Freq
keyword: #p
keyword: freq=noraman
keyword: PBEPBE/SDD
title: #p freq=noraman PBEPBE/SDD
converged: YES YES NO NO
title: Mulliken charges:
elementType: C C C C C C C C C H H H H H H H H H H H H H H H H H H H H
charge: 0.298365 0.298085 -0.400620 -0.731133 -0.725704 -0.725940 -0.725441 -0.725380 -0.731082 0.185120 0.185121 0.205317 0.203732 0.236628 0.210191 0.211724 0.209134 0.206159 0.204180 0.212552 0.211603 0.210129 0.209115 0.204075 0.212292 0.206167 0.205280 0.203863 0.236468
chargesum: 0.00000
title: Mulliken charges with hydrogens summed into heavy atoms:
elementType: C C C C C C C C C
charge: 0.298365 0.298085 -0.030379 -0.085457 -0.094655 -0.103049 -0.094594 -0.102846 -0.085471
polarizability: 1.08432905e+02 1.36615972e-01 9.28675938e+01 5.14407645e-04 -8.09290098e-04 9.18811433e+01
1716.lowfreq: -23.3395 -0.0003 0.0005 0.0005 4.8941 27.8437 73.2635 118.8605 191.7555
frequency: 73.2602 118.7928 191.7339 201.1202 215.0761 243.7823 247.7339 265.1565 291.7238 295.1178 302.9158 307.9573 352.3867 362.6930 393.8451 397.5951 408.0290 455.3743 532.7674 718.3236 754.8234 851.5193 871.5936 912.8145 917.8628 926.0948 927.4524 937.2928 940.0139 974.0728 1003.5288 1009.8102 1031.6299 1045.9125 1142.6984 1175.3462 1221.9023 1246.7829 1251.7278 1252.0392 1328.3683 1342.1134 1367.5434 1370.7414 1372.9749 1374.0861 1399.2076 1399.8763 1446.4894 1455.3851 1460.4249 1462.1726 1464.1030 1468.9100 1469.3873 1478.6931 1481.1811 1488.8815 1495.1422 1496.6219 1501.8599 2938.0599 2961.1171 2961.7146 2967.4154 2967.7124 2972.5062 2974.7154 2993.0021 3052.0800 3053.7782 3055.6877 3056.5197 3060.3681 3061.0139 3064.8146 3065.5758 3074.1557 3077.0773 3095.2142 3096.7264
redmass: 2.6141 1.9532 2.0085 1.1492 1.1896 1.3172 1.1355 2.4781 1.6207 1.1888 1.0633 1.8565 2.1027 2.1915 2.1596 2.2663 1.6799 2.1089 2.4301 3.6924 3.3804 1.8301 2.2492 1.7443 1.6872 1.5404 1.6182 1.2231 1.2000 1.9897 1.3682 1.3748 1.3966 1.3935 1.5291 2.1701 2.6889 3.2836 3.2170 3.2102 1.4600 1.3517 1.2056 1.2084 1.2170 1.2043 1.1995 1.2214 1.0734 1.0507 1.0568 1.0471 1.0503 1.0485 1.0532 1.0554 1.0629 1.0542 1.0571 1.0602 1.0566 1.0584 1.0345 1.0346 1.0358 1.0359 1.0371 1.0379 1.1006 1.0999 1.0994 1.0995 1.0993 1.0997 1.0995 1.0987 1.0982 1.0992 1.0989 1.0958 1.0955
irintensity: 0.0025 0.0047 0.0101 0.2282 0.0306 0.1665 0.0020 0.0347 0.0132 0.0380 0.0866 0.0065 0.0671 0.0916 1.1375 0.0041 0.1575 0.0061 0.0003 0.0292 0.6106 1.8661 0.0179 5.2364 1.6271 1.8728 1.6101 0.4010 0.0284 9.8968 0.0361 0.3644 0.4508 0.0398 0.0042 8.1435 2.2825 16.4384 12.6735 25.6802 0.0919 8.4781 1.7667 21.7486 15.0616 46.7923 3.7949 22.2007 0.0036 3.1024 0.0502 0.0264 3.4117 2.1532 1.6235 17.3393 2.9087 2.5829 15.4742 34.2360 14.9764 38.1624 26.8355 53.8464 22.8357 61.4687 45.6611 3.8639 25.4574 4.4348 9.4108 30.3637 0.4490 7.9175 70.4766 169.7743 64.6008 64.9304 27.9374 29.4462 41.0914
temp: 298.150 k
press: 1.00000 atm
elementType: 6 6 6 6 6 6 6 6 6 1 1 1 1 1 1 1 1 1 1 1 1 1 1 1 1 1 1 1 1
symmnumber: 1
zpe: 702469.4 jmol-1
zpe.correction: 0.267556 hartree
zpe.thermalcorrener: 0.279802 hartree
zpe.thermalcorrenthalpy: 0.280746 hartree
zpe.thermalcorrgfe: 0.231643 hartree
zpe.sumelectzpe: -354.172108 hartree
zpe.sumelectthermal: -354.159863 hartree
zpe.sumelectthermalent: -354.158918 hartree
zpe.sumelectthermalfe: -354.208021 hartree
dipole: 0.0015 0.0013 0.0683
dipole: 0.0684
quadrupole: -61.2052 -61.3338 -61.4725
quadrupole: 0.0620 -0.0008 -0.0030
quadrupole: 0.1320 0.0034 -0.1353 0.0620 -0.0008 -0.0030
hfenergy: -354.4396641 hartree
pointgroup: C01 [X(C9H20)]
dipole: -0.0005116 -0.0035088 0.0266628 debye
polarizability: 108.4302385|0.2448531|92.8577482|-0.0185054|0.1099761|91.8936558 unknown
InChI: InChI=1S/C9H20/c1-8(2,3)7-9(4,5)6/h7H2,1-6H3
charge 0 multiplicity 1
29 atoms
C  -1.389259 -0.019763 0.031595
C  1.391781 0.00545 0.026077
C  0.003384 -0.089361 0.757012
C  -1.763158 1.436633 -0.365784
C  -2.443251 -0.505283 1.07176
C  -1.494326 -0.93377 -1.217693
C  2.45205 0.249282 1.142164
C  1.487933 1.173891 -0.989962
C  1.761586 -1.326424 -0.686271
H  -0.016364 0.714515 1.5247
H  0.027233 -1.044111 1.326156
H  -1.725367 2.10712 0.514302
H  -2.793383 1.468604 -0.770532
H  -1.089042 1.847106 -1.135253
H  -2.283007 -1.568428 1.333711
H  -2.383292 0.087742 2.004481
H  -3.468801 -0.403153 0.668734
H  -0.853423 -0.580224 -2.045251
H  -2.537531 -0.946458 -1.588842
H  -1.207628 -1.975082 -0.980148
H  2.398389 -0.537991 1.918371
H  2.291628 1.226174 1.636653
H  3.475356 0.242829 0.720841
H  2.527158 1.266569 -1.36086
H  1.208089 2.13708 -0.52411
H  0.835842 1.01218 -1.866736
H  1.722561 -2.175948 0.022476
H  2.791122 -1.270758 -1.089976
H  1.084619 -1.553422 -1.525915
