program: Gaussian 09
title: 000155747
version: EM64L-G09RevD.01
frameworkgroup: C1[X(C10H16N2O)]
method: RPBEPBE
basis: SDD
operation: Freq
keyword: #p
keyword: freq=noraman
keyword: PBEPBE/SDD
title: #p freq=noraman PBEPBE/SDD
converged: NO YES NO NO
title: Mulliken charges:
elementType: O N N C C C C C C C C C C H H H H H H H H H H H H H H H H
charge: -0.252593 -0.052342 -0.066511 -0.127664 -0.064989 -0.710463 -0.710470 0.239663 0.196639 -0.427206 -0.781529 -0.227316 -0.679300 0.239500 0.228073 0.214475 0.223223 0.223226 0.214486 0.228042 0.256138 0.231302 0.256160 0.231306 0.224515 0.224618 0.209736 0.229628 0.229653
chargesum: 0.00000
title: Mulliken charges with hydrogens summed into heavy atoms:
elementType: O N N C C C C C C C C C C
charge: -0.252593 -0.052342 -0.066511 0.111836 -0.064989 -0.044692 -0.044715 0.239663 0.196639 -0.171069 -0.062761 0.221817 -0.010283
polarizability: 1.51957290e+02 4.04731495e+00 1.46658329e+02 1.72728508e-02 7.18646353e-03 8.54848415e+01
1716.lowfreq: -72.3167 -11.4426 -2.9090 -0.0007 -0.0006 -0.0005 6.1045 30.4232 54.9580
frequency: -72.3043 30.3091 54.9199 89.7287 101.3195 110.0693 185.5058 191.6668 200.2015 222.3130 238.1655 250.6152 264.4479 307.3538 323.0767 329.4160 427.9460 487.1690 528.1317 593.0830 618.8464 645.0580 676.4997 801.8380 803.3022 827.6320 856.0269 880.2737 924.2832 925.4554 955.7949 957.8627 958.9114 1009.4300 1029.3679 1049.4979 1098.8243 1109.7001 1118.1622 1135.4128 1154.0226 1171.0758 1245.1293 1245.9624 1293.6031 1315.6973 1323.3684 1359.7013 1369.6429 1379.3544 1385.6639 1391.9745 1400.0671 1405.5245 1454.0551 1460.9960 1463.0612 1469.9501 1471.4867 1472.9193 1475.3561 1487.0546 1492.0981 1518.8009 1562.7041 2979.2105 2981.3181 2988.5165 2995.5921 3007.5127 3031.9941 3065.8305 3067.8748 3075.3116 3079.3396 3084.2821 3092.2671 3092.8706 3107.6313 3121.1588 3179.4130
redmass: 1.0207 2.6889 2.7783 2.0370 3.2198 3.1718 2.5135 2.6910 1.0884 4.9634 1.1745 1.3890 2.5838 3.8480 3.3858 2.7787 3.3090 3.5038 5.3688 3.9687 2.8789 6.3398 4.6136 1.4080 2.6205 3.5321 3.1515 1.4356 1.1679 5.9345 2.5845 3.1295 1.4714 1.6325 2.2906 1.6028 1.9537 2.6728 2.2370 1.4496 1.9318 1.9123 4.7003 1.1400 2.1240 1.3083 1.7914 3.2667 1.1940 1.7381 1.9286 1.3849 1.4122 1.9740 1.2090 1.0452 1.0405 1.0460 1.0490 1.0642 1.0482 1.0804 1.0920 4.6165 6.4207 1.0343 1.0348 1.0381 1.0359 1.0580 1.0852 1.1066 1.0972 1.1005 1.0997 1.1008 1.0984 1.0993 1.1024 1.0985 1.0938
irintensity: 0.3711 0.0870 0.4583 2.4926 0.7754 2.1824 4.1999 2.1691 0.1570 2.1574 0.0811 2.5671 0.1383 2.5907 5.9707 0.8763 0.1521 0.7884 4.9010 1.7037 4.7789 4.3388 0.0979 2.1997 1.9082 7.4810 6.5699 25.7161 4.6538 17.6344 33.2942 15.5461 0.0704 22.8898 84.3118 8.3508 26.7001 1.3400 4.4632 4.3702 93.7754 20.9822 29.2057 0.0209 0.2504 0.1831 212.6131 14.7516 16.3408 8.7980 76.6770 44.5492 22.3024 11.6370 73.6765 5.6785 11.1839 16.8211 0.6328 9.5198 20.2300 6.1234 19.0544 154.6252 334.7565 36.8213 31.1814 15.0783 25.3194 19.6960 4.2910 8.6091 16.4506 17.8126 60.2424 5.9804 28.7790 60.9419 44.2984 9.1908 2.5594
temp: 298.150 k
press: 1.00000 atm
elementType: 8 7 7 6 6 6 6 6 6 6 6 6 6 1 1 1 1 1 1 1 1 1 1 1 1 1 1 1 1
symmnumber: 1
zpe: 640223.5 jmol-1
zpe.correction: 0.243848 hartree
zpe.thermalcorrener: 0.257748 hartree
zpe.thermalcorrenthalpy: 0.258692 hartree
zpe.thermalcorrgfe: 0.202627 hartree
zpe.sumelectzpe: -574.389484 hartree
zpe.sumelectthermal: -574.375584 hartree
zpe.sumelectthermalent: -574.374640 hartree
zpe.sumelectthermalfe: -574.430705 hartree
dipole: -1.4981 0.0815 0.0012
dipole: 1.5003
quadrupole: -77.1809 -71.3420 -79.4362
quadrupole: 2.6926 -0.0034 0.0010
quadrupole: -1.1946 4.6444 -3.4498 2.6926 -0.0034 0.0010
hfenergy: -574.6333319 hartree
pointgroup: C01 [X(C10H16N2O1)]
dipole: 0.5893656 -0.0325477 0.0006655 debye
polarizability: 151.9637786|4.0430662|146.6518364|0.0044946|-0.0232192|85.4848458 unknown
InChI: InChI=1S/C10H16N2O/c1-5-13-9-6-8(4)11-10(12-9)7(2)3/h6-7H,5H2,1-4H3
charge 0 multiplicity 1
29 atoms
O  2.318303 -0.537444 -0.000148
N  -1.824732 -0.785757 0.000692
N  0.209369 0.543174 -0.00023
C  -1.981704 1.682952 -0.000259
C  -1.156216 0.40559 0.000134
C  -1.698553 2.514287 -1.278565
C  -1.698198 2.515297 1.277315
C  -1.065667 -1.93966 0.000998
C  0.938137 -0.601003 0.000096
C  0.343236 -1.888466 0.000748
C  -1.817273 -3.252181 0.001621
C  2.939245 0.819851 0.000195
C  4.448413 0.599085 0.003927
H  -3.038907 1.361929 0.000021
H  -0.632536 2.800757 -1.317381
H  -2.311427 3.434232 -1.279773
H  -1.938144 1.9401 -2.191876
H  -1.937442 1.941802 2.19115
H  -2.311147 3.435195 1.278013
H  -0.632195 2.801904 1.315554
H  0.961662 -2.788682 0.001049
H  -1.563698 -3.857118 0.891762
H  -2.899868 -3.054708 0.001802
H  -1.564103 -3.857708 -0.888234
H  2.591412 1.367109 -0.894735
H  2.587021 1.368862 0.892279
H  4.967769 1.574905 0.003687
H  4.762383 0.037769 0.900481
H  4.766362 0.035228 -0.889624
