program: Gaussian 09
title: 000155735
version: EM64L-G09RevD.01
frameworkgroup: C1[X(C11H14O5)]
method: RPBEPBE
basis: SDD
operation: Freq
keyword: #pfreq=noraman
keyword: PBEPBE/SDD
title: #p freq=noraman PBEPBE/SDD
converged: YES YES NO NO
title: Mulliken charges:
elementType: O O O O O C C C C C C C C C C C H H H H H H H H H H H H H H
charge: -0.238061 -0.442716 -0.296839 -0.211943 -0.189928 -0.526830 -0.054834 0.018938 0.077045 0.240944 0.324846 -0.730761 -0.428451 -0.747606 0.141267 -0.548576 0.236003 0.275069 0.265080 0.247576 0.225008 0.208885 0.277356 0.265167 0.249549 0.264082 0.334433 0.240730 0.295788 0.228778
chargesum: 0.00000
title: Mulliken charges with hydrogens summed into heavy atoms:
elementType: O O O O O C C C C C C C C C C C
charge: -0.238061 -0.108282 -0.296839 -0.211943 -0.189928 -0.015758 0.210246 0.018938 0.077045 0.240944 0.324846 -0.049291 -0.151095 0.031192 0.141267 0.216720
polarizability: 1.95105760e+02 2.82298996e+00 1.41458655e+02 -1.22320806e+01 -6.88915200e+00 9.58466688e+01
1716.lowfreq: -14.4113 -10.5635 -7.3252 -0.0005 -0.0005 -0.0002 13.0342 42.6460 46.8946
frequency: 12.1067 42.5420 46.8148 65.9628 93.5040 115.3432 133.8011 147.8967 165.4310 176.4545 190.5868 213.0213 242.2284 260.0337 305.3642 319.7161 330.6860 352.7427 362.0182 397.6286 434.7409 456.9542 461.1648 522.8530 535.7702 567.0846 582.6997 626.0130 663.8938 717.0020 729.8936 760.0552 820.6824 856.1488 871.6164 885.6310 910.8204 963.0686 993.3744 1020.9283 1029.1430 1038.7009 1075.0747 1110.9801 1122.6072 1129.8988 1146.2811 1171.5915 1199.8265 1218.3570 1260.5430 1265.9424 1290.0053 1352.2475 1363.9992 1380.1166 1390.1011 1404.5169 1426.7553 1432.9035 1445.4078 1455.6630 1465.2888 1468.5903 1473.1482 1486.3407 1512.4057 1570.6871 1599.9239 1728.3708 2968.2503 2971.6442 2974.2167 3001.3675 3050.4204 3056.5207 3079.3386 3085.2017 3086.0117 3091.7947 3122.7291 3134.3527 3194.8410 3536.4506
redmass: 2.8329 3.7915 1.7918 4.5117 2.0387 2.3174 3.6401 3.0728 1.9158 4.2713 4.1424 3.4298 1.5741 2.2614 5.5533 4.0704 3.9136 1.0936 2.9790 4.0004 4.1377 7.1570 2.8520 5.8401 3.6080 6.4945 3.3929 5.1482 7.4641 5.8330 4.7938 5.6664 3.5205 1.7380 3.3508 2.4638 2.1060 3.8144 2.4772 2.1177 1.9457 1.5639 2.4244 2.4125 1.2818 2.0495 1.4125 1.4735 1.9700 2.8770 5.4711 1.6176 1.4676 1.6810 2.5113 1.1921 1.2265 1.2044 1.1010 1.1269 1.1488 1.1345 1.0910 1.0500 1.0495 1.0577 4.6069 8.7211 8.6191 11.5876 1.0594 1.0440 1.0315 1.0400 1.0905 1.0941 1.0918 1.1061 1.0922 1.0994 1.1029 1.1013 1.0919 1.0659
irintensity: 1.3784 2.9697 1.7487 2.7193 1.4248 8.0398 2.1528 30.2170 0.8884 4.8063 4.8830 3.0686 7.0491 1.2179 12.2324 2.7527 2.8100 166.5470 4.2507 9.0278 37.3577 13.0434 3.8014 17.7969 2.2741 3.5107 3.2053 2.0075 4.5845 73.0459 7.8456 19.8446 19.1027 18.9845 29.4899 8.4389 21.9397 115.9027 5.6164 91.3177 9.1274 15.7962 9.6043 46.4935 8.2138 68.7343 2.9288 45.6632 77.0610 45.8514 37.4882 39.5249 27.3944 35.2932 84.5390 32.8335 14.6004 40.4611 12.4984 27.2947 18.7187 55.3706 6.7572 11.0910 12.2377 31.7205 109.0851 316.9017 93.7731 716.6485 6.4012 29.5807 31.1995 2.3390 5.3519 5.2987 28.4516 7.3820 7.0459 28.6850 21.1088 2.5411 0.8056 5.8940
temp: 298.150 k
press: 1.00000 atm
elementType: 8 8 8 8 8 6 6 6 6 6 6 6 6 6 6 6 1 1 1 1 1 1 1 1 1 1 1 1 1 1
symmnumber: 1
zpe: 608437.7 jmol-1
zpe.correction: 0.231742 hartree
zpe.thermalcorrener: 0.249178 hartree
zpe.thermalcorrenthalpy: 0.250122 hartree
zpe.thermalcorrgfe: 0.185004 hartree
zpe.sumelectzpe: -802.435263 hartree
zpe.sumelectthermal: -802.417826 hartree
zpe.sumelectthermalent: -802.416882 hartree
zpe.sumelectthermalfe: -802.482000 hartree
dipole: 4.5802 -0.6371 0.9821
dipole: 4.7274
quadrupole: -116.9205 -87.3126 -94.5447
quadrupole: -6.9276 14.6401 5.5257
quadrupole: -17.3279 12.2800 5.0479 -6.9276 14.6401 5.5257
hfenergy: -802.6670044 hartree
pointgroup: C01 [X(C11H14O5)]
dipole: 1.7761366 -0.3716493 0.4080065 debye
polarizability: 193.4852454|-8.3228892|136.0589817|-16.2118309|-15.477965|102.866857 unknown
InChI: InChI=1S/C11H14O5/c1-6(12)4-8(13)11-7(2)16-10(14)5-9(11)15-3/h5-6,12H,4H2,1-3H3
charge 0 multiplicity 1
30 atoms
O  -2.760953 1.3453 -0.028828
O  3.485548 -1.281732 -0.376669
O  -0.218292 -1.930828 0.505846
O  1.333177 1.354584 -1.477001
O  -4.463461 0.229476 1.104317
C  1.911848 0.343255 0.661814
C  3.358244 0.09242 0.17199
C  -0.524325 0.436854 -0.225122
C  0.931592 0.704886 -0.467064
C  -1.457254 1.457264 -0.457461
C  -1.024732 -0.796132 0.373526
C  4.405489 0.338564 1.26893
C  -2.326756 -0.916968 0.833999
C  -1.21831 2.779764 -1.128972
C  -3.284837 0.15193 0.727174
C  0.45316 -2.427908 -0.731929
H  1.907111 1.230137 1.33169
H  1.538751 -0.504294 1.263952
H  3.550496 0.734871 -0.70327
H  5.413911 0.091536 0.894023
H  4.406219 1.397416 1.585435
H  4.204462 -0.2801 2.166257
H  -2.667191 -1.862838 1.26013
H  -0.165826 3.091301 -1.06145
H  -1.886954 3.539927 -0.693925
H  -1.449327 2.696222 -2.207358
H  3.568657 -1.913776 0.383901
H  0.709117 -3.473237 -0.50115
H  1.375946 -1.862117 -0.952006
H  -0.251809 -2.391877 -1.58118
