program: Gaussian 09
title: 000155732
version: EM64L-G09RevD.01
frameworkgroup: C1[X(C22H26NO)]
method: RPBEPBE
basis: SDD
operation: Freq
keyword: #p
keyword: freq=noraman
keyword: PBEPBE/SDD
title: #p freq=noraman PBEPBE/SDD
converged: YES YES NO NO
title: Mulliken charges:
elementType: O N C C C C C C C C C C C C C C C C C C C C C C H H H H H H H H H H H H H H H H H H H H H H H H H H
charge: -0.226778 -0.143005 -0.070852 -0.063164 -0.384867 -0.365863 -0.460455 -0.488746 -0.456316 -0.508586 -0.705947 0.107938 0.303785 -0.348202 -0.359731 -0.396794 -0.381177 0.364257 0.340550 -0.375299 -0.375240 -0.232749 -0.231336 -0.223588 0.273620 0.231982 0.316496 0.258711 0.312032 0.262244 0.234402 0.273076 0.279819 0.227661 0.233260 0.277965 0.286127 0.289126 0.244506 0.222172 0.231919 0.228874 0.280733 0.252960 0.257234 0.235708 0.239579 0.241354 0.242843 0.247759
chargesum: 1.00000
title: Mulliken charges with hydrogens summed into heavy atoms:
elementType: O N C C C C C C C C C C C C C C C C C C C C C C
charge: -0.226778 -0.143005 0.202768 0.168819 0.190340 0.208413 0.047022 0.018734 0.054909 0.066667 -0.007350 0.107938 0.303785 -0.119328 -0.078998 -0.143833 -0.123943 0.364257 0.340550 -0.139590 -0.135661 0.008605 0.011508 0.024171
polarizability: 4.55386243e+02 2.35493377e+01 2.18024880e+02 7.73398364e+00 1.08869663e+01 1.52962603e+02
1716.lowfreq: -11.3527 -5.6379 -0.0006 -0.0006 0.0009 3.5789 20.1537 30.7684 47.0420
frequency: 19.9846 30.7386 47.0399 53.0847 74.7127 75.9503 113.8375 138.5772 143.7656 154.3097 175.6651 200.0521 212.3277 235.2343 244.1509 268.9425 285.6625 337.5210 340.5276 352.6031 391.0702 400.2327 405.0812 415.7827 465.3288 482.6279 500.0818 525.4559 531.8722 545.6858 574.7555 590.7360 606.0872 610.8273 631.5702 656.7358 696.5599 706.7711 728.2236 738.8359 760.2189 775.5999 804.1628 817.3461 828.6103 848.3214 857.7521 870.0097 878.2445 896.6590 906.8782 930.2312 933.8668 946.9262 959.5773 963.6385 968.6018 980.1294 988.0141 993.2441 993.4843 1000.6489 1005.9356 1006.5042 1010.0938 1017.1957 1030.9120 1039.6349 1048.8949 1057.3081 1091.4399 1110.6819 1133.8849 1145.3495 1152.4151 1167.1982 1179.8676 1181.1049 1196.6991 1207.4615 1219.9479 1228.3173 1239.3118 1254.9421 1275.8146 1285.9415 1292.6586 1295.7038 1298.6298 1310.1244 1314.0981 1317.7307 1327.1198 1331.7061 1341.1669 1343.3608 1351.0769 1357.6357 1365.0760 1381.5723 1405.7856 1435.2321 1440.2462 1446.5901 1466.7029 1473.9699 1474.8103 1476.2939 1479.2666 1481.7282 1485.7210 1492.7578 1515.2206 1535.8585 1571.7316 1583.5837 1607.5123 1619.6331 2974.2668 2994.1106 3010.7108 3012.8748 3016.3113 3022.7257 3045.3672 3047.6186 3051.7780 3078.2495 3088.7039 3090.1817 3092.8573 3094.9208 3101.3486 3128.6436 3133.3805 3135.7571 3145.5071 3147.9743 3148.7985 3151.1304 3159.3493 3162.3243 3170.6740 3175.0379
redmass: 4.4856 3.5822 4.5019 4.5498 3.6435 3.2987 3.9886 4.4233 3.6937 5.4394 2.3340 2.2668 1.5005 2.3453 2.0643 5.4721 5.4142 2.8452 3.2288 2.3460 3.8464 2.8316 2.7986 2.6982 4.0971 3.1236 5.3948 2.3130 3.1342 3.1412 2.2434 2.5470 3.9866 6.4874 6.8852 4.4228 1.7594 3.2360 3.4486 2.9591 3.8109 1.8555 2.4446 3.0615 1.4484 1.2600 1.7907 1.8693 1.6582 2.3688 2.2889 1.4244 2.4412 2.2227 1.5983 1.8688 1.4475 1.5554 3.5428 4.9890 2.1535 1.6526 1.9417 1.4232 2.4147 2.0894 2.5346 1.9282 1.5798 1.5414 1.6328 2.6822 1.4138 1.8334 1.4038 1.9946 1.5345 1.0563 1.1172 1.1916 1.5395 1.4202 1.3661 1.6089 1.6676 1.3357 1.3387 1.3642 2.7563 1.4198 1.3917 1.4315 1.3580 1.4953 1.3055 1.4459 1.3652 1.9011 1.7480 8.8315 1.1959 4.4201 2.4318 1.1054 1.0829 1.1229 1.1407 1.7403 1.0755 1.0835 1.0505 1.0911 2.6931 6.2672 6.8413 6.1429 5.9517 6.2623 1.0839 1.0369 1.0594 1.0655 1.0673 1.0628 1.0785 1.0757 1.0652 1.1040 1.1000 1.0998 1.0992 1.0996 1.1022 1.0880 1.0870 1.0875 1.1032 1.0911 1.1035 1.0887 1.0961 1.0947 1.0973 1.1016
irintensity: 0.2034 0.0368 0.2461 0.2838 1.2325 0.5737 0.8595 6.5582 6.9076 1.9638 2.7521 2.0893 1.1843 0.5368 0.2712 9.1695 3.5819 0.1126 1.5753 1.4345 5.6223 1.2343 3.4429 0.5577 15.8201 0.8116 16.7755 2.2118 1.8991 4.5965 1.9305 7.2409 6.6645 0.2977 0.4332 5.0332 43.3104 2.6965 3.5966 16.8675 31.2525 82.2780 9.3284 6.5838 13.5567 2.2828 30.5085 5.7308 37.6811 1.2729 9.0889 1.9786 56.5319 48.2724 23.6353 0.9701 2.5079 3.0174 0.4152 9.0101 3.1958 3.7187 0.6905 0.1069 3.8991 29.5684 9.2670 1.1935 5.4478 3.2638 8.1196 1.7828 10.5487 2.1680 2.0731 1.3951 3.4077 0.1008 4.9590 210.6159 4.7549 21.6421 13.4072 156.0954 93.1916 7.0035 12.7748 5.8488 65.6336 4.3914 5.5413 5.0674 1.5950 16.3408 4.1277 3.0024 10.0391 14.6972 19.7379 2.9484 12.5816 26.9208 15.3822 15.4479 1.9606 26.5586 7.3745 4.7788 13.9253 44.1267 18.0063 15.5877 12.3945 310.8260 476.2549 37.0827 67.7871 156.7155 12.4539 15.6697 2.9020 15.6177 10.1491 20.4288 2.8868 25.6640 5.6214 1.5880 9.3218 7.8971 6.7296 22.6298 25.9836 22.7254 1.3143 2.6533 2.0812 3.0828 2.5897 0.5274 14.3551 15.7413 1.2571 25.8790
temp: 298.150 k
press: 1.00000 atm
elementType: 8 7 6 6 6 6 6 6 6 6 6 6 6 6 6 6 6 6 6 6 6 6 6 6 1 1 1 1 1 1 1 1 1 1 1 1 1 1 1 1 1 1 1 1 1 1 1 1 1 1
symmnumber: 1
zpe: 1123885.2 jmol-1
zpe.correction: 0.428065 hartree
zpe.thermalcorrener: 0.449158 hartree
zpe.thermalcorrenthalpy: 0.450102 hartree
zpe.thermalcorrgfe: 0.377151 hartree
zpe.sumelectzpe: -981.952649 hartree
zpe.sumelectthermal: -981.931556 hartree
zpe.sumelectthermalent: -981.930612 hartree
zpe.sumelectthermalfe: -982.003563 hartree
dipole: -9.2806 2.2937 1.4116
dipole: 9.6635
quadrupole: -23.7123 -126.6760 -134.8533
quadrupole: -3.0361 -2.5699 -1.1935
quadrupole: 71.3682 -31.5954 -39.7728 -3.0361 -2.5699 -1.1935
hfenergy: -982.3807143 hartree
pointgroup: C01 [X(C22H26N1O1)]
dipole: 3.6493752 0.6852755 0.8167147 debye
polarizability: 454.7478855|-0.615604|153.6838582|-27.6690615|12.8427639|217.9419834 unknown
InChI: InChI=1S/C22H26NO/c1-17-13-15-23(14-5-8-21(17)23)16-22(24)20-11-9-19(10-12-20)18-6-3-2-4-7-18/h2-4,6-7,9-12,17,21H,5,8,13-16H2,1H3
charge 1 multiplicity 1
50 atoms
O  1.450328 -0.71422 -2.073799
N  3.484251 0.208281 -0.394321
C  4.455398 0.762058 0.752634
C  5.166372 -0.501677 1.307097
C  3.838701 -1.299421 -0.547601
C  3.83944 1.032812 -1.662929
C  5.325931 1.8260 0.048217
C  5.236651 -1.431759 0.068924
C  4.451603 2.331014 -1.122132
C  2.030107 0.416375 0.009787
C  6.51385 -0.229598 2.003059
C  1.016714 -0.193477 -0.99803
C  -0.412702 -0.124773 -0.647469
C  -0.895419 0.474104 0.554634
C  -1.360883 -0.68133 -1.557205
C  -2.26947 0.511202 0.831561
C  -2.731443 -0.644397 -1.273085
C  -3.224168 -0.048186 -0.07156
C  -4.677004 -0.01017 0.229575
C  -5.143788 -0.016992 1.57576
C  -5.639929 0.030972 -0.81984
C  -6.523121 0.013354 1.862143
C  -7.019046 0.068969 -0.532468
C  -7.467296 0.058666 0.809426
H  3.805017 1.239589 1.505854
H  4.489152 -0.977299 2.0467
H  3.735666 -1.575768 -1.604805
H  3.095963 -1.871554 0.033848
H  2.940937 1.134174 -2.284607
H  4.588355 0.448712 -2.222809
H  6.257176 1.380468 -0.344866
H  5.61069 2.626808 0.749275
H  5.453103 -2.477753 0.341741
H  6.027306 -1.103194 -0.631813
H  3.673478 3.034801 -0.77358
H  5.039338 2.847286 -1.898245
H  1.898518 -0.037107 1.008359
H  1.858714 1.50406 0.10557
H  6.934527 -1.174768 2.387733
H  7.257143 0.207869 1.314042
H  6.397981 0.454872 2.862147
H  -0.20784 0.928665 1.277289
H  -0.99008 -1.147626 -2.475623
H  -2.618684 1.007318 1.74235
H  -3.43443 -1.109384 -1.970945
H  -4.428974 -0.087336 2.4032
H  -5.310845 0.07164 -1.864042
H  -6.863839 -0.007247 2.902514
H  -7.744186 0.113797 -1.351557
H  -8.539162 0.084565 1.031888
