program: Gaussian 09
title: 000155730
version: EM64L-G09RevD.01
frameworkgroup: C1[X(C15H15N2O2)]
method: RPBEPBE
basis: SDD
operation: Freq
keyword: #p
keyword: freq=noraman
keyword: PBEPBE/SDD
title: #p freq=noraman PBEPBE/SDD
converged: YES YES NO NO
title: Mulliken charges:
elementType: O O N N C C C C C C C C C C C C C C C H H H H H H H H H H H H H H H
charge: -0.422117 -0.462744 -0.064867 -0.040423 0.249563 0.489218 0.486531 -0.583160 -0.564953 -0.553627 -0.611983 0.160534 0.482923 -0.836628 -0.833026 -0.334821 -0.324654 -0.350922 -0.358096 0.221993 0.209267 0.274191 0.325876 0.213201 0.219248 0.226946 0.198103 0.202512 0.221310 0.217616 0.247838 0.272764 0.210001 0.212387
chargesum: -1.00000
title: Mulliken charges with hydrogens summed into heavy atoms:
elementType: O O N N C C C C C C C C C C C C C C C
charge: -0.422117 -0.462744 -0.064867 -0.040423 0.249563 0.489218 0.486531 -0.308969 -0.239077 -0.122367 -0.398783 0.160534 0.482923 -0.192332 -0.191588 -0.086983 -0.051889 -0.140921 -0.145709
polarizability: 3.36240308e+02 1.24208720e+01 2.05490506e+02 -4.47298406e+00 5.73126101e-01 1.27544152e+02
1716.lowfreq: -13.4283 -5.8810 -0.0008 -0.0006 0.0002 4.6136 7.3029 23.0332 25.1454
frequency: -6.4835 22.5169 24.9073 28.4063 44.8095 61.2169 93.3272 133.9104 162.0774 196.5192 205.8809 228.8213 244.6382 254.6604 298.2931 336.2285 371.4213 379.5901 415.1115 435.3483 471.9380 483.6575 509.9874 524.6278 533.7674 549.4633 614.9458 629.4448 659.1783 662.8336 724.1855 743.5502 782.1361 814.3487 844.9376 851.3325 875.0006 906.0860 935.5032 937.6362 945.9765 953.4087 957.0379 963.6456 966.6891 982.8449 1009.8867 1014.0528 1044.4520 1048.4454 1060.5120 1066.4630 1081.9668 1126.1673 1158.6333 1203.6434 1205.8401 1228.2972 1267.4149 1283.7272 1308.2661 1318.2523 1332.5266 1354.3045 1376.2996 1383.3531 1384.2884 1403.7356 1406.1154 1428.0295 1438.7159 1460.9528 1467.1378 1469.5638 1470.5698 1478.7684 1481.8131 1543.6174 1580.5064 1592.4914 1601.5142 2956.1084 2958.3808 3011.6622 3033.6673 3036.6156 3066.7507 3067.8047 3081.2822 3082.3454 3104.7396 3111.1035 3116.3281 3131.1633 3155.2236 3161.1504
redmass: 1.0702 4.6884 3.7644 4.4866 1.0117 8.9661 7.0620 4.2831 4.8905 5.8166 3.5207 3.2620 3.8364 4.3538 5.1315 5.9102 6.3607 2.5419 3.1495 2.7017 4.8131 4.1526 4.6015 3.4401 4.7586 5.2484 3.9383 7.2736 5.0542 6.7030 2.3876 3.4601 2.5784 5.0299 2.1825 1.3875 1.2577 2.5875 1.4405 2.8878 2.0054 1.3261 2.1445 1.6820 1.8276 6.0429 1.6126 2.2023 1.5272 1.5901 2.3290 2.6265 1.6111 1.5416 1.4218 1.8972 1.4184 2.4727 1.2590 3.7587 1.7173 3.0690 1.4491 3.3097 5.1399 1.2740 1.2727 2.2467 3.7247 2.5227 1.6340 2.1226 1.2330 1.3979 1.0907 1.2481 1.2120 6.2081 5.6150 6.2343 6.0627 1.0378 1.0375 1.0567 1.0951 1.0954 1.0989 1.0990 1.0906 1.1060 1.0878 1.0902 1.0936 1.0909 1.0948 1.0964
irintensity: 0.1784 0.4428 0.1528 0.9052 0.1874 0.6478 8.7401 2.1019 0.6880 4.2471 7.7051 0.0214 14.9095 2.8931 5.9372 2.8188 14.0119 0.8248 2.1937 1.3460 6.2308 12.8013 8.2804 1.4836 0.1258 12.9131 36.2796 7.8356 2.3788 0.2765 17.4685 3.7939 12.9270 13.1010 28.7680 19.6545 3.1620 3.5994 11.6965 6.7805 15.3587 17.0829 17.5720 4.4551 4.7897 21.0861 1.4409 6.2951 3.7499 34.2248 19.7952 47.8454 16.9485 27.0983 0.5226 4.1173 26.0885 7.8453 1.3395 14.5217 8.6317 10.7623 0.5345 20.1141 3.1047 15.5712 4.5345 19.0565 23.7054 15.3636 30.6754 9.5624 11.0093 24.4887 11.7736 25.2805 48.2495 23.8913 267.2651 14.5027 103.2322 90.1132 73.5606 70.3998 37.1746 40.9295 21.0379 21.1999 57.2993 6.4982 61.4749 37.2334 21.3562 6.9648 18.8555 6.1640
temp: 298.150 k
press: 1.00000 atm
elementType: 8 8 7 7 6 6 6 6 6 6 6 6 6 6 6 6 6 6 6 1 1 1 1 1 1 1 1 1 1 1 1 1 1 1
symmnumber: 1
zpe: 693334.6 jmol-1
zpe.correction: 0.264077 hartree
zpe.thermalcorrener: 0.281192 hartree
zpe.thermalcorrenthalpy: 0.282136 hartree
zpe.thermalcorrgfe: 0.216299 hartree
zpe.sumelectzpe: -839.210407 hartree
zpe.sumelectthermal: -839.193292 hartree
zpe.sumelectthermalent: -839.192348 hartree
zpe.sumelectthermalfe: -839.258185 hartree
dipole: -3.1893 -0.0276 -0.2985
dipole: 3.2033
quadrupole: -153.0391 -123.1861 -124.1821
quadrupole: 2.8713 12.6360 -0.6193
quadrupole: -19.5700 10.2830 9.2870 2.8713 12.6360 -0.6193
hfenergy: -839.4744845 hartree
pointgroup: C01 [X(C15H15N2O2)]
dipole: 1.2524381 0.1348262 -0.0392339 debye
polarizability: 336.8022406|-7.8088893|162.279067|-9.170429|-37.9101214|170.1936587 unknown
InChI: InChI=1S/C15H15N2O2/c1-11-7-12(2)9-14(8-11)15(18)17(19)10-13-3-5-16-6-4-13/h3-9H,10H2,1-2H3
charge -1 multiplicity 1
34 atoms
O  -0.056195 -1.946368 0.41757
O  -0.714416 0.706295 -2.004718
N  -0.769864 -0.400854 -1.184108
N  -4.698907 0.749027 1.830013
C  1.571022 -0.288689 -0.330722
C  3.290706 1.338181 -1.029482
C  3.848211 -0.400901 0.633071
C  2.5294 -0.891264 0.536897
C  1.969482 0.833562 -1.113613
C  -2.093419 -1.106742 -1.174567
C  4.2234 0.715569 -0.162554
C  0.211255 -0.908731 -0.341418
C  -3.008839 -0.485865 -0.142424
C  3.694842 2.554139 -1.853207
C  4.848183 -1.039952 1.587919
C  -3.75443 0.687902 -0.435786
C  -3.108064 -1.0065 1.175728
C  -4.570225 1.258882 0.565011
C  -3.955312 -0.371089 2.107856
H  -1.911444 -2.169847 -0.941876
H  -2.491785 -0.978821 -2.195878
H  2.192102 -1.754693 1.122688
H  1.213052 1.276498 -1.771539
H  5.252185 1.100939 -0.104365
H  3.401901 3.495891 -1.346716
H  3.195511 2.549252 -2.838987
H  4.788405 2.591305 -2.017037
H  5.884335 -0.952526 1.209498
H  4.626001 -2.111758 1.73972
H  4.819947 -0.554897 2.584795
H  -3.677665 1.148191 -1.426234
H  -2.497983 -1.871716 1.454635
H  -5.155165 2.164989 0.359389
H  -4.05393 -0.760809 3.129045
