program: Gaussian 09
title: 000155726
version: EM64L-G09RevD.01
frameworkgroup: C1[X(C14H16O5)]
method: RPBEPBE
basis: SDD
operation: Freq
keyword: #pfreq=noraman
keyword: PBEPBE/SDD
title: #p freq=noraman PBEPBE/SDD
converged: YES YES NO NO
title: Mulliken charges:
elementType: O O O O O C C C C C C C C C C C C C C H H H H H H H H H H H H H H H H
charge: -0.216551 -0.194247 -0.191352 -0.293612 -0.281249 -0.218350 -0.239382 -0.568029 0.485762 0.191189 0.203881 -0.541673 -0.432818 -0.777209 0.223675 -0.324666 0.212616 -0.520525 -0.536299 0.273594 0.286801 0.274589 0.263743 0.257325 0.269466 0.250236 0.237741 0.263830 0.242470 0.259145 0.213247 0.229987 0.227638 0.224251 0.244779
chargesum: 0.00000
title: Mulliken charges with hydrogens summed into heavy atoms:
elementType: O O O O O C C C C C C C C C C C C C C
charge: -0.216551 -0.194247 -0.191352 -0.293612 -0.281249 0.055243 0.047420 -0.029696 0.485762 0.191189 0.203881 -0.284348 -0.163352 -0.025402 0.223675 -0.082196 0.212616 0.181854 0.160369
polarizability: 2.17507602e+02 -4.19439856e+00 1.75119398e+02 -3.51337107e+00 -1.80850926e+00 1.12023005e+02
1716.lowfreq: -6.8233 0.0007 0.0008 0.0009 5.4856 7.2583 18.2832 28.7998 44.7801
frequency: 17.3780 28.4668 44.7768 53.2618 71.1193 73.2926 98.6610 107.3147 123.5540 142.7831 170.6999 183.6148 204.0688 220.5965 241.9374 255.6104 285.1282 310.5725 330.6680 347.5367 400.0284 452.7493 465.7672 489.7571 504.7344 534.1310 553.0847 576.0483 595.3889 629.1770 667.7669 710.8637 720.3866 733.0208 756.8243 795.3849 807.0413 822.8071 869.4206 897.9922 925.1824 944.0468 949.1332 965.4212 982.4645 989.3517 1002.0196 1023.7334 1062.3033 1109.3218 1111.2346 1111.8681 1112.9358 1146.0118 1153.3382 1156.0544 1173.0014 1184.4930 1202.1457 1210.8173 1248.4281 1257.5340 1273.7021 1282.6026 1312.0194 1329.2622 1372.6766 1379.7975 1401.2700 1431.7420 1440.7306 1441.2768 1446.5678 1455.6736 1456.4561 1467.0051 1473.7595 1481.5448 1497.8175 1581.1157 1617.5933 1632.3240 1704.0872 2964.5554 2977.1749 2982.2208 3020.9107 3034.5658 3038.7427 3054.9103 3069.7310 3086.4780 3089.8819 3123.3286 3126.7762 3129.0958 3135.8445 3154.3048 3176.3578
redmass: 4.7619 4.3474 4.6095 6.3588 2.1008 4.9743 3.2645 1.0908 2.2861 1.9550 4.3775 3.4596 3.1029 4.2737 1.6381 2.1356 9.5233 3.6206 4.3119 3.7233 5.4766 4.3612 5.0522 3.6076 3.0447 5.5142 3.6060 5.2643 4.9195 4.6282 4.9032 5.0251 5.5012 3.5521 5.3986 2.2013 4.9827 1.8364 2.9557 1.8463 2.5545 2.4640 1.4645 2.6696 5.7983 2.9092 3.1047 2.5563 2.6993 2.4090 1.3203 1.4310 3.0440 1.4739 1.4218 1.4031 1.4173 1.6338 1.4181 1.8470 1.6439 2.2367 1.4840 1.8162 1.4202 1.7848 1.2245 4.3801 2.8687 1.2263 1.2922 1.0816 1.0671 1.0694 1.0624 1.0508 1.1032 1.0539 2.6085 7.4033 6.6551 8.5620 12.6763 1.0325 1.0346 1.0393 1.0673 1.0790 1.0851 1.1042 1.0933 1.0972 1.1012 1.1008 1.1000 1.1047 1.0912 1.0873 1.0954
irintensity: 3.3475 0.1617 6.4586 0.5919 4.5255 4.5609 7.5151 1.1818 4.5621 0.8813 3.4684 3.6284 4.7193 6.1629 0.1165 0.2757 0.5043 4.9132 1.0610 4.0996 4.0951 9.4228 1.6878 5.9590 1.6319 15.0022 1.2199 2.7995 6.2809 7.4291 8.0918 12.9276 9.6814 5.5345 0.3235 33.9284 13.4711 29.5352 12.2390 18.4408 21.9244 60.4556 12.9983 21.4825 25.8915 48.1441 41.2583 17.6937 33.4940 88.7025 20.9472 69.6902 199.9589 6.0832 23.0910 0.9185 8.1991 10.4520 21.0859 47.5866 123.5345 115.7420 11.8565 64.8556 4.8273 57.7683 59.5317 27.1782 13.1050 0.2226 20.1861 8.0591 31.6318 14.5434 15.7226 14.3733 76.2856 24.3629 134.9089 17.4208 9.5311 113.8479 381.0690 64.4727 84.7571 1.6400 7.7135 4.7105 8.8014 42.6503 10.3082 36.9433 6.3739 10.8617 21.6365 16.8505 5.2739 7.3405 4.2391
temp: 298.150 k
press: 1.00000 atm
elementType: 8 8 8 8 8 6 6 6 6 6 6 6 6 6 6 6 6 6 6 1 1 1 1 1 1 1 1 1 1 1 1 1 1 1 1
symmnumber: 1
zpe: 717509.1 jmol-1
zpe.correction: 0.273285 hartree
zpe.thermalcorrener: 0.292575 hartree
zpe.thermalcorrenthalpy: 0.293519 hartree
zpe.thermalcorrgfe: 0.223170 hartree
zpe.sumelectzpe: -917.757069 hartree
zpe.sumelectthermal: -917.737779 hartree
zpe.sumelectthermalent: -917.736835 hartree
zpe.sumelectthermalfe: -917.807184 hartree
dipole: -4.3307 1.8811 3.6317
dipole: 5.9568
quadrupole: -100.9075 -115.8240 -113.9276
quadrupole: 21.1427 17.1318 -1.9034
quadrupole: 9.3122 -5.6043 -3.7079 21.1427 17.1318 -1.9034
hfenergy: -918.0303543 hartree
pointgroup: C01 [X(C14H16O5)]
dipole: 1.7592236 0.74854 -1.3554056 debye
polarizability: 217.6626926|3.9088693|175.0201621|0.459415|2.7568836|111.9671503 unknown
InChI: InChI=1S/C14H16O5/c1-8(15)10-7-13(16)19-14(10)9-4-5-11(17-2)12(6-9)18-3/h4-6,10,14H,7H2,1-3H3
charge 0 multiplicity 1
35 atoms
O  -2.077573 -1.356421 0.964186
O  -3.493147 -2.833989 -0.130065
O  -3.582578 1.810963 1.101874
O  2.894932 2.138041 -0.057064
O  4.23403 -0.373767 -0.24835
C  -2.215238 0.576202 -0.516812
C  -1.449894 -0.027863 0.708241
C  -2.874192 -0.658803 -1.192624
C  0.047819 -0.18222 0.482824
C  -2.891245 -1.750095 -0.114317
C  -3.264469 1.628614 -0.101436
C  0.840497 0.985985 0.357934
C  0.676989 -1.442421 0.407191
C  -3.864657 2.461914 -1.225588
C  2.22935 0.915953 0.133904
C  2.069681 -1.531711 0.180847
C  2.85574 -0.367183 0.026482
C  4.130694 2.38603 0.716996
C  4.883214 -1.677855 -0.41271
H  -1.508377 1.062224 -1.213106
H  -1.66757 0.572803 1.609435
H  -2.277015 -1.02715 -2.045933
H  -3.901396 -0.491757 -1.556035
H  0.402002 1.987559 0.441382
H  0.086402 -2.352577 0.542383
H  -3.165108 3.286283 -1.469317
H  -4.010243 1.877173 -2.15065
H  -4.81888 2.907336 -0.904096
H  2.532711 -2.520962 0.117398
H  4.92142 1.671148 0.439274
H  3.923445 2.32022 1.802639
H  4.423272 3.414055 0.454606
H  4.433803 -2.244388 -1.250692
H  4.825514 -2.276949 0.516463
H  5.933965 -1.446987 -0.641366
