program: Gaussian 09
title: 000155703
version: EM64L-G09RevD.01
frameworkgroup: C1[X(C14H22N2O3)]
method: RPBEPBE
basis: SDD
operation: Freq
keyword: #p
keyword: freq=noraman
keyword: PBEPBE/SDD
title: #p freq=noraman PBEPBE/SDD
converged: YES YES NO NO
title: Mulliken charges:
elementType: O O O N N C C C C C C C C C C C C C C H H H H H H H H H H H H H H H H H H H H H H
charge: -0.287240 -0.470996 -0.244679 -0.337944 -0.712674 -0.103809 -0.436497 -0.020522 -0.310419 -0.721099 -0.664494 0.210096 0.244714 -0.329363 -0.548334 0.536613 -0.423388 0.145431 -0.785157 0.197682 0.229915 0.231245 0.187310 0.247031 0.226636 0.224689 0.214969 0.220945 0.207870 0.226084 0.197570 0.212372 0.382341 0.245858 0.232379 0.222283 0.240484 0.234572 0.263131 0.306374 0.308019
chargesum: 0.00000
title: Mulliken charges with hydrogens summed into heavy atoms:
elementType: O O O N N C C C C C C C C C C C C C C
charge: -0.287240 -0.088655 -0.244679 -0.090913 -0.098281 0.093873 0.024663 0.166788 0.140906 -0.077314 -0.028467 0.210096 0.244714 -0.083505 -0.315954 0.536613 -0.201106 0.145431 -0.046969
polarizability: 2.42068799e+02 1.33052196e+01 1.85530685e+02 -1.85733861e+01 1.54196212e+01 1.33300573e+02
1716.lowfreq: 0.0003 0.0005 0.0007 4.5722 7.8962 12.7732 19.2387 25.1553 37.9393
frequency: 19.1118 24.4079 37.8295 54.8921 73.2279 94.3905 99.5326 136.2628 141.5753 155.5249 163.3902 196.9379 200.6822 213.6727 222.6380 245.6655 278.8481 312.0873 325.9925 332.4544 337.1482 351.4774 366.1705 376.1909 382.4096 417.7758 426.1703 447.5000 466.8945 500.3139 521.5517 530.8848 605.5204 620.6358 628.7646 675.8088 696.6163 728.2681 750.3239 777.1949 815.3232 817.8058 836.3693 864.4939 902.0515 912.3984 917.5457 933.2522 936.6924 945.5382 951.3069 953.8291 1017.2252 1020.6387 1037.0078 1061.2925 1073.9746 1085.4085 1101.7605 1135.9467 1149.1485 1160.4148 1180.0831 1214.7979 1224.9326 1238.7817 1245.6657 1268.9254 1270.6002 1310.8940 1326.2647 1329.1391 1337.5868 1339.4893 1365.6521 1369.0992 1376.1563 1388.5412 1389.4286 1399.4174 1427.2613 1446.7749 1450.4114 1450.6298 1462.8580 1465.6484 1466.8328 1475.3023 1485.8230 1489.9652 1495.6213 1561.0500 1584.8577 1633.4580 1646.8223 2858.0833 2925.4924 2971.1454 2979.7561 2986.8331 2988.2443 3004.4188 3061.8296 3063.5805 3071.4863 3075.5878 3076.1792 3083.9751 3086.4002 3124.8577 3125.7162 3143.0773 3158.0361 3274.2559 3420.2528 3572.7054 3712.2857
redmass: 4.1234 4.1563 2.9670 3.7265 4.4369 4.3160 3.4246 4.4397 4.6492 1.0848 3.3630 1.2765 4.5291 4.7299 1.9207 1.1134 3.3608 3.6656 2.9399 1.1093 1.2814 3.7834 3.7225 2.7864 4.7549 2.4485 3.0990 2.9347 4.2328 2.8140 3.2772 3.0749 3.4427 3.0641 3.7814 1.4874 5.5007 3.0293 1.1016 3.8935 2.4297 1.6373 2.6520 1.6946 3.3576 3.2545 1.1927 1.7245 1.4663 2.5476 1.7128 2.2410 2.1064 1.7638 1.5215 2.1172 2.4045 2.9864 1.7948 2.0939 1.3059 1.6941 1.9537 1.4255 1.7083 1.6610 3.0081 1.5663 1.2545 1.3840 2.7824 1.4648 1.3491 1.3840 1.3247 1.2497 1.2641 1.2252 6.4345 1.2362 3.0392 1.1405 1.1276 1.1523 1.0545 1.1150 1.0483 1.0884 1.0953 1.1647 2.2640 6.0603 7.8511 2.3126 1.6737 1.0825 1.0700 1.0360 1.0355 1.0383 1.0614 1.0775 1.0919 1.0977 1.1096 1.0952 1.0997 1.0991 1.0993 1.0892 1.0997 1.0900 1.0952 1.0692 1.0741 1.0450 1.1040
irintensity: 1.0245 1.0792 0.5667 0.9231 2.8848 6.8787 2.2840 0.9383 3.6296 0.7798 1.4735 1.3755 0.6975 2.0271 8.5829 0.4951 0.2303 5.7375 19.6343 32.6564 243.1115 35.4696 4.2309 1.5131 4.1453 6.8528 2.5211 7.0875 6.6764 1.3767 7.5928 8.9683 5.2043 12.6878 17.5478 44.7308 0.8477 10.1016 189.3625 5.4508 10.0545 44.2402 2.7883 29.1882 58.4512 28.4932 3.2572 3.0382 6.6946 41.6368 2.7884 24.2424 14.9652 2.6944 6.7251 5.7237 53.8487 22.9554 10.1725 30.2011 16.3740 20.7926 51.5365 8.1072 126.9153 171.1262 118.0891 11.7851 4.7848 21.6287 91.6779 7.4402 14.7521 4.8598 16.3675 42.3804 37.0839 16.6106 10.8315 39.0284 35.5530 75.3353 21.5812 39.3891 18.6110 1.2874 1.1902 8.9815 6.1426 48.9703 137.7247 290.9352 131.3091 13.1677 167.9735 91.7424 72.8078 40.1631 19.4915 5.8317 9.8989 87.0069 11.0588 51.8603 27.9225 12.6621 20.8244 38.5342 67.1510 24.8289 7.4162 19.6590 8.6794 512.7017 2.7076 77.9112 20.7426
temp: 298.150 k
press: 1.00000 atm
elementType: 8 8 8 7 7 6 6 6 6 6 6 6 6 6 6 6 6 6 6 1 1 1 1 1 1 1 1 1 1 1 1 1 1 1 1 1 1 1 1 1 1
symmnumber: 1
zpe: 899885.7 jmol-1
zpe.correction: 0.342748 hartree
zpe.thermalcorrener: 0.363854 hartree
zpe.thermalcorrenthalpy: 0.364799 hartree
zpe.thermalcorrgfe: 0.291840 hartree
zpe.sumelectzpe: -880.367603 hartree
zpe.sumelectthermal: -880.346497 hartree
zpe.sumelectthermalent: -880.345553 hartree
zpe.sumelectthermalfe: -880.418511 hartree
dipole: -4.3613 -4.0040 1.8686
dipole: 6.2084
quadrupole: -74.1292 -115.1353 -118.0831
quadrupole: 3.3123 -4.6680 11.7850
quadrupole: 28.3200 -12.6861 -15.6339 3.3123 -4.6680 11.7850
hfenergy: -880.7103512 hartree
pointgroup: C01 [X(C14H22N2O3)]
dipole: -2.070319 0.7880286 1.0291002 debye
polarizability: 246.2660116|-8.0450803|127.5018927|3.1206257|-10.8734281|187.132153 unknown
InChI: InChI=1S/C14H22N2O3/c1-9(2)16-7-12(18)8-19-14-5-4-11(15)6-13(14)10(3)17/h4-6,9,12,16,18H,7-8,15H2,1-3H3
charge 0 multiplicity 1
41 atoms
O  0.080805 -0.062419 0.156435
O  1.610664 -1.864099 -1.317586
O  -0.260729 -0.138417 -2.568761
N  3.680763 0.161557 1.105703
N  -5.554064 0.161104 0.432832
C  2.074297 -1.381533 -0.024834
C  3.018731 -0.162475 -0.180072
C  4.250755 1.533204 1.228813
C  0.88913 -1.062777 0.902686
C  5.262799 1.546436 2.392878
C  3.126407 2.565674 1.466746
C  -1.307864 -0.11177 0.226139
C  -2.055345 0.204284 -0.954471
C  -1.992719 -0.364932 1.439972
C  -3.470281 0.31623 -0.852697
C  -4.16036 0.066812 0.360332
C  -3.393871 -0.289095 1.508641
C  -1.40186 0.348647 -2.294083
C  -2.163156 1.076652 -3.4031
H  2.641485 -2.223416 0.420486
H  2.416434 0.704828 -0.503207
H  3.731888 -0.393557 -1.003715
H  4.795064 1.822913 0.294428
H  4.390729 -0.547578 1.339433
H  1.248245 -0.620558 1.850192
H  0.278879 -1.968057 1.07983
H  5.678427 2.559098 2.539696
H  4.765516 1.233651 3.330002
H  6.108149 0.857278 2.200908
H  2.361148 2.524169 0.671631
H  3.539152 3.591652 1.489626
H  2.625423 2.359661 2.430128
H  0.960346 -1.201439 -1.707114
H  -1.417486 -0.597376 2.342117
H  -4.052177 0.568086 -1.745956
H  -3.901938 -0.490158 2.459721
H  -2.591444 2.031408 -3.051129
H  -2.994283 0.451121 -3.781577
H  -1.469142 1.261915 -4.236877
H  -6.105103 0.405046 -0.384074
H  -6.043314 -0.02817 1.301877
