program: Gaussian 09
title: 000155696
version: EM64L-G09RevD.01
frameworkgroup: C1[X(C16H19ClO9)]
method: RPBEPBE
basis: SDD
operation: Freq
keyword: #p
keyword: freq=noraman
keyword: PBEPBE/SDD
title: #p freq=noraman PBEPBE/SDD
converged: YES YES NO NO
title: Mulliken charges:
elementType: Cl O O O O O O O O O C C C C C C C C C C C C C C C C H H H H H H H H H H H H H H H H H H H
charge: -0.072709 -0.267215 -0.246648 -0.457477 -0.447795 -0.464386 -0.297024 -0.469082 -0.171555 -0.199726 -0.151852 -0.095551 -0.157453 0.013447 -0.084562 0.160570 0.169620 0.249197 -0.705679 -0.697965 0.319369 -0.332648 -0.352641 -0.196151 -0.202176 -0.118429 0.229000 0.249031 0.247667 0.250364 0.256974 0.372263 0.369575 0.383254 0.234457 0.248230 0.223545 0.213360 0.231162 0.264165 0.405403 0.313341 0.248746 0.282607 0.253377
chargesum: 0.00000
title: Mulliken charges with hydrogens summed into heavy atoms:
elementType: Cl O O O O O O O O O C C C C C C C C C C C C C C C C
charge: -0.072709 -0.267215 -0.246648 -0.085214 -0.078220 -0.081132 -0.297024 -0.063679 -0.171555 -0.199726 0.077148 0.153481 0.090213 0.263811 0.172412 0.160570 0.169620 0.249197 0.000554 0.010722 0.319369 -0.019308 -0.103895 0.086456 0.051201 -0.118429
polarizability: 2.55043389e+02 -1.44613626e+01 2.49703984e+02 -9.93741170e-01 7.60784961e+00 1.32307274e+02
1716.lowfreq: -5.4755 -2.6073 0.0014 0.0014 0.0015 3.6804 9.8468 33.1881 38.5229
frequency: 9.6971 33.1696 38.5222 42.8790 50.6271 59.0304 61.1061 71.5816 80.8556 98.1575 119.8466 145.0989 163.7076 177.6215 195.2728 199.1168 224.5582 229.0448 244.1835 255.5724 265.3467 270.1710 277.9666 298.4715 314.6806 326.5449 352.3909 371.7213 377.6312 384.4051 397.4887 411.3571 419.2957 423.2280 440.0818 442.3031 484.9128 493.3255 510.3313 521.5616 536.9783 546.3471 572.2241 592.4815 614.6023 622.2251 628.6914 636.1228 688.0368 699.6534 719.8164 741.4611 789.0975 822.4012 844.6732 861.9585 874.0007 913.2488 932.1095 937.0556 945.0259 960.2627 969.2869 987.2603 991.2765 997.9199 1005.8822 1023.4027 1033.0427 1050.6346 1054.8892 1065.0236 1072.0833 1076.6898 1082.3494 1095.6191 1103.2460 1137.4193 1168.8754 1180.0443 1186.1501 1217.6280 1221.2324 1225.4038 1227.3094 1236.5844 1254.3104 1273.2672 1284.4977 1294.3818 1302.1601 1309.6998 1329.5819 1343.9703 1360.2779 1380.3224 1381.5085 1389.0926 1398.0955 1401.8005 1402.8934 1451.6907 1457.6076 1465.7429 1467.3992 1479.6327 1584.1514 1586.6499 1645.2546 1698.6985 2937.6583 2955.2402 2991.7045 2996.1921 3001.6771 3005.0999 3010.0230 3099.7418 3106.8243 3109.6997 3127.3010 3153.0850 3169.9493 3174.2355 3184.7764 3498.2712 3519.6970 3549.3955 3562.6120
redmass: 7.0692 5.7713 10.0748 9.1711 7.1606 6.6933 10.3533 5.3532 6.2769 7.6734 7.4082 5.5198 6.8878 5.3576 1.2011 2.4767 3.3654 3.4105 1.4135 4.0686 4.5539 5.9636 5.1231 5.0608 5.0036 4.9901 5.3581 5.9615 3.8604 3.1851 1.8137 2.4166 3.0551 4.4521 2.8502 1.5458 4.0094 4.4213 1.3472 3.3453 3.7786 3.3270 3.5389 2.3220 3.2609 5.8890 2.9658 4.6902 4.0692 5.7266 5.1213 3.9755 5.8911 1.4199 3.6985 1.5606 6.0374 2.9193 5.3011 1.6206 1.3575 4.5546 5.9947 1.6119 2.5434 2.5038 1.9288 3.9096 4.7254 3.1420 3.4696 2.6057 3.2090 2.9749 2.9943 2.7605 1.3444 2.2876 1.5491 1.3353 2.0039 1.2028 2.0856 1.4811 1.3395 3.3298 1.2255 1.4701 1.2609 1.3280 1.2019 1.2033 1.2631 1.3949 6.5239 1.3284 1.5882 3.5227 1.2485 1.4477 1.7048 1.0507 1.0725 2.0322 1.0895 1.0638 7.0695 6.9610 11.6928 9.8463 1.0806 1.0819 1.0846 1.0848 1.0355 1.0359 1.0854 1.1004 1.0995 1.1008 1.1004 1.0885 1.0894 1.0973 1.0973 1.0656 1.0642 1.0656 1.0656
irintensity: 0.1175 2.1037 0.2217 0.9422 0.3949 0.0868 0.5373 1.6472 2.9831 2.5157 0.6561 1.9476 2.7357 2.7443 0.2188 3.6306 0.8721 5.6004 0.1946 8.3325 1.4897 7.6701 7.9042 6.7157 8.2017 1.4032 0.4893 0.6329 12.5676 18.2357 73.6432 49.0847 0.2913 12.9465 21.8801 148.3664 6.2649 19.2229 133.5801 7.3177 27.9898 56.4971 17.1202 122.6519 29.3323 10.0267 57.7753 55.6018 17.9266 17.4239 4.1758 2.7442 24.2484 20.8993 25.6786 43.9537 19.7183 8.8719 78.2673 18.0112 1.8315 181.5413 5.3775 14.2389 145.6508 388.0016 170.5243 58.2587 74.4785 192.9995 13.0602 54.3200 1.3328 62.3262 15.2837 175.3442 4.1979 150.4031 38.7313 10.3454 28.0216 15.4286 17.8578 29.4870 2.1019 3.2580 11.5593 19.9266 1.6451 26.1922 24.4530 21.4654 45.0082 14.8507 0.1542 12.5410 12.7341 10.8224 29.3423 23.1087 21.6918 5.5738 3.8445 143.8827 7.7811 26.5366 2.4639 1.8307 137.9602 268.9823 13.2398 18.1904 13.8939 10.7546 6.2464 18.1580 64.8885 2.6867 29.6416 18.5871 11.8310 4.0020 9.6713 3.1564 19.5732 79.7873 36.9629 24.7114 31.4472
temp: 298.150 k
press: 1.00000 atm
elementType: 17 8 8 8 8 8 8 8 8 8 6 6 6 6 6 6 6 6 6 6 6 6 6 6 6 6 1 1 1 1 1 1 1 1 1 1 1 1 1 1 1 1 1 1 1
symmnumber: 1
zpe: 880849.1 jmol-1
zpe.correction: 0.335498 hartree
zpe.thermalcorrener: 0.362004 hartree
zpe.thermalcorrenthalpy: 0.362948 hartree
zpe.thermalcorrgfe: 0.276973 hartree
zpe.sumelectzpe: -1756.170559 hartree
zpe.sumelectthermal: -1756.144053 hartree
zpe.sumelectthermalent: -1756.143109 hartree
zpe.sumelectthermalfe: -1756.229084 hartree
dipole: 4.2833 1.6340 0.2704
dipole: 4.5923
quadrupole: -152.7717 -138.7569 -165.8023
quadrupole: 24.9645 0.1113 0.6418
quadrupole: -0.3281 13.6868 -13.3587 24.9645 0.1113 0.6418
hfenergy: -1756.506057 hartree
pointgroup: C01 [X(C16H19Cl1O9)]
dipole: 1.7897181 -0.2475529 -0.0002314 debye
polarizability: 248.1479595|13.8227347|256.5880008|5.5688735|6.0503293|132.3186866 unknown
InChI: InChI=1S/C16H19ClO9/c1-16(2,26-8-5-3-7(17)4-6-8)15(23)25-14-11(20)9(18)10(19)12(24-14)13(21)22/h3-6,9-12,14,18-21H,1-2H3
charge 0 multiplicity 1
45 atoms
Cl -4.267362 -4.240768 -0.187431
O  1.346597 -0.249699 -0.109986
O  0.258046 1.778659 0.037686
O  4.882856 1.445377 1.325371
O  2.836741 3.138799 0.252585
O  4.996027 -1.17331 0.163088
O  -2.528479 1.480842 0.712407
O  3.298993 -3.304984 -0.206603
O  0.99871 -2.962294 -0.200255
O  -0.495731 1.543304 -2.163779
C  3.910051 0.929481 0.362965
C  2.620852 1.738033 0.594422
C  3.70898 -0.586176 0.525094
C  1.528249 1.199876 -0.334435
C  2.546394 -1.025961 -0.419424
C  2.14237 -2.491628 -0.264988
C  -2.068901 2.367743 -0.408957
C  -0.725847 1.848055 -0.978615
C  -3.118504 2.421955 -1.530108
C  -1.854032 3.728848 0.276091
C  -2.908762 0.139555 0.415802
C  -1.941219 -0.868393 0.191513
C  -4.284477 -0.184299 0.472486
C  -2.354535 -2.206374 0.00126
C  -4.703472 -1.521423 0.292257
C  -3.728215 -2.509401 0.052111
H  4.268542 1.110926 -0.675346
H  2.297399 1.620542 1.64901
H  3.431424 -0.824025 1.573457
H  1.749813 1.394955 -1.403799
H  2.87629 -0.86769 -1.472429
H  5.722776 0.930128 1.213695
H  3.630612 3.445792 0.762892
H  4.895961 -2.162872 0.154127
H  -2.793621 3.112423 -2.326623
H  -3.272675 1.430539 -1.987222
H  -4.074875 2.780305 -1.112868
H  -1.478119 4.475411 -0.445438
H  -2.817606 4.07868 0.683365
H  -1.129047 3.629535 1.098335
H  3.035678 -4.262289 -0.135527
H  -0.871873 -0.641309 0.190266
H  -5.013285 0.608028 0.669144
H  -1.60448 -2.983433 -0.168444
H  -5.763841 -1.785763 0.337652
