program: Gaussian 09
title: 000155688
version: EM64L-G09RevD.01
frameworkgroup: C1[X(C5H2Cl6)]
method: RPBEPBE
basis: SDD
operation: Freq
keyword: #pfreq=noraman
keyword: PBEPBE/SDD
title: #p freq=noraman PBEPBE/SDD
converged: NO NO NO NO
title: Mulliken charges:
elementType: Cl Cl Cl Cl Cl Cl C C C C C H H
charge: 0.106095 0.098148 0.128859 0.069922 0.071148 0.046224 -0.419751 -0.416047 -0.349352 0.111472 -0.028578 0.288979 0.292881
chargesum: 0.00000
title: Mulliken charges with hydrogens summed into heavy atoms:
elementType: Cl Cl Cl Cl Cl Cl C C C C C
charge: 0.106095 0.098148 0.128859 0.069922 0.071148 0.046224 -0.419751 -0.416047 0.232508 0.111472 -0.028578
polarizability: 1.20645352e+02 7.78653665e+00 1.09613207e+02 -5.03770771e+00 3.70363291e+00 9.80003763e+01
1716.lowfreq: -5.5046 0.0024 0.0033 0.0035 8.9679 9.1299 59.2931 82.3383 116.8524
frequency: 59.2707 82.3367 116.8500 146.1049 156.3923 183.6408 184.9366 223.4322 230.2659 272.4328 322.4973 346.6488 350.2184 363.7859 491.6361 504.4718 543.6666 609.1560 628.3005 741.2615 808.0005 870.5538 964.7384 992.7892 1072.7859 1108.8257 1168.2915 1171.6671 1279.4727 1441.6834 1624.1881 3016.2660 3107.7184
redmass: 25.0244 17.0406 30.8824 33.8270 32.6581 25.4306 16.8252 15.8128 22.3900 12.4134 6.4586 27.0228 18.3388 4.2691 5.8793 8.5439 7.1011 13.2685 5.7329 7.7558 9.5830 11.1814 2.9542 2.9984 6.4810 4.0132 7.2626 1.2625 1.6195 1.0888 9.6783 1.0641 1.0993
irintensity: 0.1616 0.5114 0.0914 0.2270 0.3127 0.7229 0.5411 1.4971 0.9339 2.0256 0.5650 0.4100 0.5795 0.6591 21.0051 17.0253 20.0102 70.6009 131.6577 38.0639 63.7614 6.3595 38.9462 21.9723 2.2249 9.0413 109.8010 9.2624 30.2457 18.0300 76.3576 1.1262 0.3997
temp: 298.150 k
press: 1.00000 atm
elementType: 17 17 17 17 17 17 6 6 6 6 6 1 1
symmnumber: 1
zpe: 150635.5 jmol-1
zpe.correction: 0.057374 hartree
zpe.thermalcorrener: 0.069278 hartree
zpe.thermalcorrenthalpy: 0.070222 hartree
zpe.thermalcorrgfe: 0.017675 hartree
zpe.sumelectzpe: -2951.229191 hartree
zpe.sumelectthermal: -2951.217287 hartree
zpe.sumelectthermalent: -2951.216343 hartree
zpe.sumelectthermalfe: -2951.268890 hartree
dipole: -1.0441 -2.0562 -0.8025
dipole: 2.4417
quadrupole: -107.7142 -102.0831 -104.1948
quadrupole: 0.4690 -0.0506 2.7124
quadrupole: -3.0501 2.5809 0.4692 0.4690 -0.0506 2.7124
hfenergy: -2951.2865654 hartree
pointgroup: C01 [X(C5H2Cl6)]
dipole: 0.4323067 0.809512 -0.2839537 debye
dipolederiv: -0.565839 0.1086817 -0.2269051 0.1011528 -0.1215197 0.0462579 -0.2137309 0.0373894 -0.2538132 -0.1771227 0.0345402 0.0361629 0.0381045 -0.1601092 -0.16177 0.0249071 -0.1201285 -0.5892243 -0.2082435 -0.1796542 0.1580491 -0.1837252 -0.3326425 0.2348974 0.1365827 0.1949963 -0.3379452 -0.2485223 -0.1214977 -0.046416 -0.1210904 -0.2933344 -0.2081386 -0.2067959 -0.2605402 -0.6534873 -0.2879262 0.3236405 -0.0920906 0.2528165 -0.3623043 0.0947114 -0.0750465 0.0712701 0.0175914 -0.7012278 -0.3434046 0.0108262 -0.2399974 -0.210502 0.0238884 0.0024458 0.025665 0.0284775 0.857927 -0.2652782 0.2546988 -0.134746 0.2417062 0.1173253 0.2262329 0.1111221 0.9126024 0.6254816 0.6251528 -0.1372395 0.3926097 0.5910475 0.0090624 -0.0764132 0.0068262 1.0814479 -0.2099316 -0.044516 -0.0095813 -0.0313432 -0.1226544 0.0560804 -0.0330147 0.1304844 -0.0298836 -0.056608 -0.7526466 0.1185976 -0.5924931 0.313691 -0.17123 0.2402605 -0.0146799 -0.1780425 0.8499226 0.5337849 -0.0722453 0.4956031 0.3765061 -0.0130748 -0.0149629 -0.1541889 -0.0722019 0.0805868 0.0224791 0.0000129 0.0135511 -0.0032363 -0.0369369 -0.0011122 -0.0589553 0.095588 0.0415032 0.0587181 0.0061304 0.0095576 0.0833519 0.0089271 -0.0093528 0.0307394 -0.0211092 unknown
polarizability: 120.8061277|7.4387331|109.5141169|5.5454225|-3.3360615|97.9386908 unknown
InChI: InChI=1S/C5H2Cl6/c6-2-1-4(8,9)5(10,11)3(2)7/h1H2
charge 0 multiplicity 1
13 atoms
Cl -2.652706 0.988151 -0.820982
Cl -1.284774 1.133959 1.859544
Cl -1.223038 -1.988031 1.103138
Cl -0.781247 -1.448074 -1.829174
Cl 2.122007 -1.884587 0.444958
Cl 2.955615 1.44502 -0.177177
C  -1.043034 0.697234 0.044033
C  -0.48058 -0.772594 -0.072309
C  0.105196 1.582207 -0.507408
C  1.001485 -0.553531 0.096035
C  1.318805 0.743821 -0.158749
H  0.109732 2.581238 -0.045767
H  0.007939 1.691988 -1.603942
