program: Gaussian 09
title: 000155685
version: EM64L-G09RevD.01
frameworkgroup: C1[X(C6H3BrO)]
method: RPBEPBE
basis: SDD
operation: Freq
keyword: #p
keyword: freq=noraman
keyword: PBEPBE/SDD
title: #p freq=noraman PBEPBE/SDD
converged: NO YES NO NO
title: Mulliken charges:
elementType: Br O C C C C C C H H H
charge: 0.047222 -0.241428 0.282003 0.205821 -0.337597 -0.337959 -0.179928 -0.187690 0.256763 0.252464 0.240329
chargesum: 0.00000
title: Mulliken charges with hydrogens summed into heavy atoms:
elementType: Br O C C C C C C
charge: 0.047222 -0.241428 0.282003 0.205821 -0.337597 -0.081196 0.072536 0.052640
polarizability: 1.19495437e+02 -2.69208743e+00 8.07749646e+01 -1.01232248e-02 3.14883376e-02 2.98865785e+01
1716.lowfreq: -2.8446 0.0004 0.0007 0.0008 7.6553 12.0476 94.8761 164.8469 215.4738
frequency: 94.8735 164.8467 215.4734 275.5027 357.7003 412.9590 474.8204 560.6302 599.9640 639.5477 748.1432 817.6257 862.1218 907.7341 935.2767 982.5373 1101.9679 1148.2022 1185.9313 1339.0086 1390.4387 1436.8213 1500.8982 1821.6366 3147.7457 3172.6786 3205.8897
redmass: 5.8073 12.9366 7.8459 8.5121 9.9067 4.4235 5.5833 10.0090 8.4815 4.6992 1.2369 8.9055 1.3213 7.8154 1.3003 3.0068 2.0276 1.8950 1.2615 3.3790 2.1238 3.8533 8.7164 11.0134 1.0872 1.0949 1.0979
irintensity: 0.9765 0.5560 0.1521 1.4875 3.0358 3.1255 0.0444 17.2773 5.5287 6.1412 86.8270 90.4578 3.1959 101.2379 0.8399 19.5777 13.1363 6.5793 1.3052 31.5191 26.7413 11.1081 18.8518 42.2614 2.7207 3.8623 2.6988
temp: 298.150 k
press: 1.00000 atm
elementType: 35 8 6 6 6 6 6 6 1 1 1
symmnumber: 1
zpe: 176455.0 jmol-1
zpe.correction: 0.067208 hartree
zpe.thermalcorrener: 0.074230 hartree
zpe.thermalcorrenthalpy: 0.075174 hartree
zpe.thermalcorrgfe: 0.034395 hartree
zpe.sumelectzpe: -318.412269 hartree
zpe.sumelectthermal: -318.405248 hartree
zpe.sumelectthermalent: -318.404303 hartree
zpe.sumelectthermalfe: -318.445082 hartree
dipole: 1.5099 -2.7522 -0.0018
dipole: 3.1391
quadrupole: -47.0728 -54.7225 -57.5285
quadrupole: -4.9201 -0.0133 0.0072
quadrupole: 6.0351 -1.6146 -4.4206 -4.9201 -0.0133 0.0072
hfenergy: -318.4794774 hartree
pointgroup: C01 [X(C6H3Br1O1)]
dipole: 0.5749354 1.0929627 -0.0140255 debye
dipolederiv: -0.6875165 -0.0672367 0.0432543 -0.0669332 -0.0410285 0.0031661 0.0428718 0.0030551 0.0067434 -0.1694328 0.0765579 0.0070435 0.2769682 -0.9861768 -0.0349885 0.0090058 -0.0174652 -0.092709 -0.5727918 0.1589257 0.0426501 -0.4265276 0.410069 0.0330512 0.033202 -0.0087509 0.0689151 0.1102989 -0.2562268 -0.0109061 0.2340159 0.4988417 -0.0062421 -0.0007299 0.021939 0.0037749 1.497228 0.0860255 -0.100884 0.0584899 0.0791005 0.0010426 -0.1019372 0.0014419 -0.101283 0.1018303 0.0894927 -0.0121157 -0.0213617 -0.0311638 0.0042661 -0.0145069 -0.0016889 -0.1288101 -0.3644208 -0.1231017 0.0122147 0.0814057 -0.0178014 -0.0027707 0.0180815 0.0102214 -0.128883 0.0106634 0.0251194 -0.0110132 -0.12311 0.0272263 0.0114731 -0.0143935 0.002472 -0.1716628 -0.0364539 -0.0114633 0.0142037 -0.0167148 0.1171096 -0.000632 0.013681 -0.0011601 0.1975656 0.0587571 0.0603664 0.0085698 0.0718348 0.0061731 -0.0079047 0.0081768 -0.0074892 0.1727461 0.0518379 -0.0384591 0.0069829 -0.0680672 -0.0623497 -0.0004612 0.0065485 -0.0025751 0.1736028 unknown
polarizability: 119.0330638|3.4391711|80.8611603|-5.6197127|0.839268|30.2627559 unknown
InChI: InChI=1S/C6H3BrO/c7-4-2-1-3-5-6(4)8-5/h1-3H
charge 0 multiplicity 1
11 atoms
Br -3.021901 -0.093687 0.220554
O  0.665067 -2.169114 -0.055594
C  -0.159561 -0.878535 0.017092
C  1.176723 -0.701044 -0.060881
C  -1.096258 0.119446 0.10069
C  1.879724 0.482124 -0.080841
C  -0.460032 1.42668 0.086947
C  0.938783 1.590197 0.001121
H  2.959979 0.617702 -0.14428
H  -1.100659 2.312194 0.145993
H  1.341236 2.608935 -0.003501
