program: Gaussian 09
title: 000155679
version: EM64L-G09RevD.01
frameworkgroup: C1[X(C12H8O3)]
method: RPBEPBE
basis: SDD
operation: Freq
keyword: #pfreq=noraman
keyword: PBEPBE/SDD
title: #p freq=noraman PBEPBE/SDD
converged: NO YES NO YES
title: Mulliken charges:
elementType: O O O C C C C C C C C C C C C H H H H H H H H
charge: -0.283980 -0.281825 -0.431374 0.297993 0.211860 0.232012 0.245770 -0.513530 -0.337263 -0.362799 -0.366852 0.325107 -0.391853 -0.226579 -0.224914 0.283460 0.257644 0.259021 0.257829 0.227118 0.233877 0.233477 0.355803
chargesum: 0.00000
title: Mulliken charges with hydrogens summed into heavy atoms:
elementType: O O O C C C C C C C C C C C C
charge: -0.283980 -0.281825 -0.075571 0.297993 0.211860 0.232012 0.245770 -0.230070 -0.079620 -0.103778 -0.109024 0.325107 -0.164735 0.007298 0.008563
polarizability: 2.37144028e+02 -4.40687097e+00 1.36107556e+02 3.74557020e-04 6.46717761e-04 5.29357907e+01
1716.lowfreq: -12.5604 -0.0008 -0.0003 0.0006 5.1026 10.8569 40.0055 102.8957 179.3400
frequency: 40.0039 102.8955 179.3399 195.7497 232.8835 275.1079 327.9862 343.2588 349.6060 365.8178 445.7343 448.9803 455.4396 496.6512 527.6644 542.8060 581.0745 581.8900 647.3653 668.1579 689.2119 709.0567 744.7933 755.6104 781.1213 806.2343 839.6796 846.1880 854.8396 906.1894 928.1567 942.8469 968.2652 1025.7338 1071.4033 1083.5078 1132.4653 1153.9992 1158.4668 1163.2107 1181.5304 1231.0425 1255.1486 1274.7385 1287.5599 1379.6569 1400.2697 1435.5499 1458.9242 1476.4873 1494.0248 1590.2801 1601.0891 1615.3866 1648.1532 3133.8288 3142.3579 3155.9118 3167.3854 3171.4018 3178.8818 3188.3939 3584.4538
redmass: 7.2948 4.5996 6.4276 5.6472 6.3158 5.5966 6.6610 1.1200 6.8929 5.8697 3.1207 3.1345 4.2221 9.2492 4.4977 11.6148 7.8671 4.7096 6.4877 3.6627 4.1923 6.8224 7.6300 1.2288 1.3919 6.4704 6.3459 1.3505 1.4966 1.3216 1.3663 3.8277 1.2948 2.0084 2.9373 2.7597 1.3794 1.7984 1.8218 1.1208 1.7677 2.7970 1.5591 1.4474 5.1702 8.9464 6.4420 2.6228 3.5566 2.9975 3.3643 7.6052 6.9617 8.2164 7.7364 1.0899 1.0856 1.0902 1.0947 1.0949 1.1006 1.0929 1.0662
irintensity: 3.1457 1.0606 0.0453 3.7709 0.8606 0.1527 4.0768 139.9888 5.9333 1.4627 0.9023 6.6318 4.8466 0.9250 0.2068 0.1942 3.0388 14.8556 0.2438 2.5311 0.2867 0.1274 8.6537 111.0701 51.8308 58.4461 28.1651 0.7905 37.7820 3.7646 7.1499 81.4065 0.0000 12.1430 51.9686 23.1490 137.2098 78.3800 48.3864 0.0572 8.9338 173.3162 108.3827 21.2864 145.8908 77.4164 44.8847 17.2448 114.9400 364.5988 167.8469 24.1342 13.2714 19.1775 41.6069 15.3371 1.8114 13.0968 8.0053 2.3756 12.1420 0.2220 52.3099
temp: 298.150 k
press: 1.00000 atm
elementType: 8 8 8 6 6 6 6 6 6 6 6 6 6 6 6 1 1 1 1 1 1 1 1
symmnumber: 1
zpe: 439160.2 jmol-1
zpe.correction: 0.167267 hartree
zpe.thermalcorrener: 0.178541 hartree
zpe.thermalcorrenthalpy: 0.179485 hartree
zpe.thermalcorrgfe: 0.130051 hartree
zpe.sumelectzpe: -686.690701 hartree
zpe.sumelectthermal: -686.679427 hartree
zpe.sumelectthermalent: -686.678483 hartree
zpe.sumelectthermalfe: -686.727917 hartree
dipole: -0.6258 1.4812 0.0004
dipole: 1.6079
quadrupole: -62.3180 -82.3716 -91.4029
quadrupole: -8.7385 -0.0006 0.0002
quadrupole: 16.3795 -3.6741 -12.7054 -8.7385 -0.0006 0.0002
hfenergy: -686.8579681 hartree
pointgroup: C01 [X(C12H8O3)]
dipole: -0.2488033 0.5816249 0.0001658 debye
dipolederiv: -1.959392 0.0983176 -0.0000088 0.1634829 -0.3704089 -0.0000216 -0.0000138 -0.0000419 -0.1536617 -1.9528165 0.1236655 -0.0000083 0.1727903 -0.3501235 0.0000187 -0.0000119 0.0000367 -0.1449271 -1.4357585 -0.4769828 0.0000156 -0.6380587 -0.2866882 0.0000438 0.0000091 0.0000327 -0.4245256 1.2243566 -0.1402884 -0.0000417 -0.954888 0.3634968 0.0000181 -0.0000583 0.0000195 0.0905822 1.1104088 0.138973 -0.0000337 0.8546779 -0.1272936 -0.000011 -0.0000387 -0.000019 0.0293579 1.2625995 0.1119439 0.0000541 0.8478117 0.0330289 0.0000164 0.0000715 0.0000176 0.0662093 1.1148012 -0.2687145 0.0000438 -1.0422911 0.1966093 -0.0000237 0.00005 -0.0000225 0.0741063 -0.5874896 -0.0924224 0.0000013 0.0931654 0.0107461 0.0000037 0.0000207 0.0000101 -0.1853957 0.0551163 -0.1218171 -0.0000157 0.092335 0.0831591 -0.000005 -0.0000048 0.0000025 -0.1303396 -0.2107048 -0.0288335 0.0000067 0.0489996 0.0666019 0.0000069 -0.000001 0.0000002 -0.162272 -0.2540068 0.0742743 0.0000068 -0.0151264 0.0642905 -0.0000047 0.0000014 0.0000042 -0.1667537 1.3901049 0.3996424 -0.0000399 0.582833 0.3006347 -0.0000265 -0.0000525 -0.0000151 0.0705873 -0.2952194 0.0279872 0.0000018 -0.4055265 -0.1392095 0.0000173 -0.0000085 -0.0000003 -0.2345051 -0.0111194 -0.0150965 0.0000125 -0.0649387 0.0084371 -0.000006 0.0000205 -0.0000023 -0.176526 0.0233153 0.0126913 0.0000121 0.0569757 0.0014324 0.0000059 0.0000152 0.0000006 -0.1731561 0.1130918 0.0085055 0.000005 -0.0027065 0.0130777 -0.0000011 0.0000073 0.0000006 0.1907024 0.1011783 -0.0347934 0.0000034 -0.0194884 -0.0327372 -0.0000009 0.0000051 -0.0000006 0.1727019 0.1012091 -0.0391647 -0.0000056 -0.0161153 -0.0378661 -0.0000012 -0.0000065 -0.0000008 0.1755514 0.1034864 0.0158962 -0.000005 -0.008768 -0.0458856 -0.0000014 -0.0000043 -0.0000022 0.1757658 -0.1081532 0.08083 0.000011 0.0671765 0.048554 -0.0000033 0.0000092 -0.0000038 0.1842844 -0.0648319 0.0935985 -0.0000119 0.1017324 0.0251215 0.0000056 -0.0000145 0.0000059 0.168231 -0.0941695 -0.0756834 -0.0000129 -0.0835661 0.0536328 -0.0000048 -0.0000154 -0.0000043 0.1672174 0.3739935 0.1074711 0.0000096 0.1694934 0.1213895 -0.0000253 0.0000202 -0.0000179 0.3867653 unknown
polarizability: 237.181472|-3.9542288|136.0701118|0.0003717|0.0006484|52.9357907 unknown
InChI: InChI=1S/C12H8O3/c13-8-5-6-11-12(7-8)15-10-4-2-1-3-9(10)14-11/h1-7,13H
charge 0 multiplicity 1
23 atoms
O  0.212761 -1.374866 -0.000174
O  0.448183 1.54262 -0.000135
O  -4.575009 -1.027069 0.000091
C  -0.927301 -0.531151 -0.000081
C  -0.813692 0.8831 -0.000057
C  1.474241 -0.71757 -0.000062
C  1.586791 0.69582 -0.000049
C  -2.184302 -1.149227 -0.00002
C  -1.970418 1.67448 0.000012
C  2.62508 -1.521295 0.000013
C  2.853434 1.302627 0.000036
C  -3.346689 -0.343405 0.00005
C  -3.247865 1.068222 0.000059
C  3.902487 -0.912798 0.000091
C  4.015763 0.496126 0.0001
H  -2.26238 -2.238645 -0.000025
H  -1.861958 2.762814 0.000016
H  2.504803 -2.608801 0.000006
H  2.910781 2.395282 0.000047
H  -4.148701 1.693274 0.000099
H  4.799726 -1.539691 0.000145
H  5.002114 0.970784 0.000156
H  -5.332551 -0.390931 0.000182
