program: Gaussian 09
title: 000155674
version: EM64L-G09RevD.01
frameworkgroup: C1[X(C19H14F3NO2)]
method: RPBEPBE
basis: SDD
operation: Freq
keyword: #p
keyword: freq=noraman
keyword: PBEPBE/SDD
title: #p freq=noraman PBEPBE/SDD
converged: YES YES NO NO
title: Mulliken charges:
elementType: F F F O O N C C C C C C C C C C C C C C C C C C C H H H H H H H H H H H H H H
charge: -0.164858 -0.171526 -0.170892 -0.287516 -0.431440 -0.080151 0.191199 0.204519 0.367506 0.030245 -0.366692 -0.372569 0.338286 -0.521964 -0.370693 0.292163 -0.607817 -0.345017 -0.375563 -0.226203 -0.354759 0.236805 -0.409274 -0.364521 0.284987 0.266936 0.265353 0.262121 0.297443 0.255260 0.240143 0.243902 0.291123 0.227866 0.236189 0.262679 0.220726 0.249767 0.356237
chargesum: 0.00000
title: Mulliken charges with hydrogens summed into heavy atoms:
elementType: F F F O O N C C C C C C C C C C C C C C C C C C C
charge: -0.164858 -0.171526 -0.170892 -0.287516 -0.075203 -0.080151 0.191199 0.204519 0.367506 0.030245 -0.099756 -0.107216 0.338286 -0.259843 -0.073250 0.292163 0.131488 -0.053895 -0.147697 0.009985 -0.092080 0.236805 -0.188548 -0.114754 0.284987
polarizability: 3.80571112e+02 4.33497021e+00 2.44806760e+02 -1.80198424e+01 1.72354997e+01 1.20196407e+02
1716.lowfreq: -6.0286 -2.8416 0.0001 0.0003 0.0007 3.0680 12.1967 17.5599 35.8381
frequency: 12.1904 17.5386 35.8345 52.5528 57.6376 60.5835 85.0661 90.1261 113.6654 127.0213 169.4360 175.5361 211.9683 234.6060 273.4019 276.7861 294.1729 305.7788 338.8463 342.5863 355.7451 377.4580 393.0544 401.1102 413.2031 416.8846 427.7766 456.0143 466.5994 502.6072 516.3303 526.5607 554.1816 557.5643 606.6823 619.8804 633.1014 634.5700 658.2141 696.3334 715.2042 723.0012 781.4825 788.1708 802.4190 807.1605 813.2286 829.0327 836.3290 860.7818 871.8747 907.2716 916.4710 925.2261 937.7572 952.9951 975.8723 986.6351 988.3070 1002.9530 1011.6804 1043.3434 1063.7739 1078.3969 1107.9369 1110.1031 1116.3267 1134.4388 1147.4600 1186.8897 1191.7368 1197.2324 1252.2362 1253.9581 1292.7256 1306.1017 1313.1750 1322.2123 1353.5047 1356.9253 1383.0375 1387.0985 1421.3675 1429.8015 1441.4430 1442.0545 1473.1497 1478.1353 1493.8910 1503.3784 1514.4612 1549.5320 1585.7730 1588.0875 1613.8894 1620.9772 1629.5146 2994.8123 3088.7547 3115.6114 3118.0701 3126.5609 3146.5718 3148.7664 3157.6777 3163.1916 3169.8295 3170.3211 3195.8271 3198.2572 3580.4297
redmass: 15.5486 9.1877 5.3655 6.5871 4.7253 1.0644 4.8280 7.3110 4.8638 6.0814 6.0236 4.9060 8.4880 4.0711 4.8405 5.4555 6.8853 6.3340 6.8158 8.4811 5.1151 1.1223 5.4570 5.1903 3.1870 4.3969 4.8086 5.1675 6.8366 3.2110 6.6723 5.0921 3.6220 6.3462 11.2123 6.1908 6.1240 7.3148 5.4951 1.9663 8.4587 3.9012 3.8748 6.7815 4.1719 1.3910 1.7157 1.9821 4.5792 1.5005 1.4271 2.6989 2.2743 1.4222 1.3808 1.3543 9.0541 3.8863 1.6102 2.9341 6.3632 5.6824 2.2673 2.5239 1.6855 1.5352 1.3210 1.8471 1.3622 1.2081 1.2998 1.7026 2.4856 2.3973 3.1794 1.6421 1.3596 2.2290 2.4373 2.3715 4.1981 4.4813 3.2242 3.5870 2.1807 1.5545 1.0523 2.2652 1.3232 2.7858 7.3622 6.1894 6.1383 5.9563 6.1057 6.1716 5.2857 1.0357 1.1004 1.0910 1.1020 1.0889 1.0882 1.0913 1.0915 1.0941 1.0952 1.0961 1.0938 1.0951 1.0660
irintensity: 0.3135 0.1528 1.1760 1.7641 6.9479 0.6469 0.3762 3.3242 1.9835 0.7681 0.8700 2.3449 0.7954 0.6950 1.3504 0.8875 1.3449 1.3584 2.0297 7.8658 1.2979 146.7074 14.3842 3.2094 0.7153 4.7564 0.9370 0.4502 12.1100 15.7349 3.3046 7.4816 11.0324 37.8224 16.4809 2.6659 5.8338 8.3912 0.2896 29.6934 9.9896 7.6102 17.7548 31.8031 18.6700 11.2919 20.0491 65.9742 22.3715 2.2109 31.0782 41.9484 20.4423 8.6295 3.5277 1.7923 208.8150 9.2638 13.9899 4.1289 139.2104 89.9311 10.8985 72.2770 46.9266 50.9043 14.3491 49.5370 252.3315 46.0847 22.8456 37.1728 119.5601 152.8205 40.8960 91.3660 1.6184 135.0407 18.0707 72.2908 5.7384 13.5253 14.4092 8.6391 43.0381 12.7811 24.1439 22.8691 66.1067 42.6723 85.5409 59.4490 27.3850 22.7846 9.5022 109.7508 81.2699 63.2480 15.9996 27.0334 6.2433 9.6444 9.1770 3.9846 8.6803 2.3034 10.7693 5.3863 4.9220 4.2643 65.4814
temp: 298.150 k
press: 1.00000 atm
elementType: 9 9 9 8 8 7 6 6 6 6 6 6 6 6 6 6 6 6 6 6 6 6 6 6 6 1 1 1 1 1 1 1 1 1 1 1 1 1 1
symmnumber: 1
zpe: 745762.8 jmol-1
zpe.correction: 0.284046 hartree
zpe.thermalcorrener: 0.305953 hartree
zpe.thermalcorrenthalpy: 0.306897 hartree
zpe.thermalcorrgfe: 0.230060 hartree
zpe.sumelectzpe: -1235.405772 hartree
zpe.sumelectthermal: -1235.383865 hartree
zpe.sumelectthermalent: -1235.382921 hartree
zpe.sumelectthermalfe: -1235.459758 hartree
dipole: -3.4818 4.0536 -2.9397
dipole: 6.0988
quadrupole: -165.0828 -112.1313 -147.4070
quadrupole: -0.8364 -1.5458 2.1917
quadrupole: -23.5424 29.4091 -5.8667 -0.8364 -1.5458 2.1917
hfenergy: -1235.689818 hartree
pointgroup: C01 [X(C19H14F3N1O2)]
dipole: -1.5042168 -1.8256818 -0.4020894 debye
polarizability: 377.8853937|-29.7464933|160.4680422|8.7014466|59.5149399|207.2208423 unknown
InChI: InChI=1S/C19H14F3NO2/c1-23-10-16(12-5-7-15(24)8-6-12)18(25)17(11-23)13-3-2-4-14(9-13)19(20,21)22/h2-11,24H,1H3
charge 0 multiplicity 1
39 atoms
F  6.439795 0.88858 -0.167702
F  6.069503 -1.322641 -0.480674
F  5.143124 0.181156 -1.895317
O  -0.83014 0.671435 1.511971
O  -7.192176 1.692034 0.583256
N  -0.677851 -2.239913 -1.455558
C  0.49989 -0.791903 0.104568
C  -1.992485 -0.613866 -0.194632
C  1.807073 -0.344468 0.656456
C  -0.779223 -0.18447 0.554199
C  0.486144 -1.805463 -0.848617
C  -1.885947 -1.639993 -1.127557
C  -3.31825 0.016548 0.035981
C  2.967188 -0.352159 -0.163934
C  1.942647 0.096283 2.004466
C  4.221531 0.035327 0.35373
C  -0.659839 -3.406317 -2.365797
C  -3.697602 0.531445 1.307846
C  -4.26742 0.111984 -1.025754
C  3.199242 0.492398 2.510168
C  4.350872 0.459317 1.697056
C  5.434302 -0.040997 -0.52427
C  -4.975687 1.08754 1.515196
C  -5.545011 0.664136 -0.830711
C  -5.903371 1.149219 0.448491
H  1.398168 -2.331634 -1.143337
H  -2.764388 -2.047037 -1.635088
H  2.889632 -0.616987 -1.223645
H  1.053069 0.142235 2.634652
H  -0.907669 -4.336639 -1.823551
H  0.340477 -3.509637 -2.814779
H  -1.390808 -3.25731 -3.177236
H  -2.975004 0.505169 2.124853
H  -3.989707 -0.2138 -2.035244
H  3.279504 0.831113 3.548123
H  5.32427 0.772382 2.086559
H  -5.243743 1.475491 2.506788
H  -6.263589 0.747497 -1.651228
H  -7.338519 2.026345 1.502973
