program: Gaussian 09
title: 000155672
version: EM64L-G09RevD.01
frameworkgroup: C1[X(C9H18NO2)]
method: RPBEPBE
basis: SDD
operation: Freq
keyword: #p
keyword: freq=noraman
keyword: PBEPBE/SDD
title: #p freq=noraman PBEPBE/SDD
converged: YES YES NO NO
title: Mulliken charges:
elementType: O O N C C C C C C C C C H H H H H H H H H H H H H H H H H H
charge: -0.344079 -0.129012 -0.095837 0.044054 -0.412365 -0.543510 -0.066486 0.121351 -0.582062 -0.555470 -0.569181 -0.686493 0.241357 0.275200 0.276381 0.287057 0.264302 0.260245 0.266007 0.263663 0.302467 0.273959 0.269512 0.268972 0.331714 0.253898 0.254468 0.226486 0.260975 0.242426
chargesum: 1.00000
title: Mulliken charges with hydrogens summed into heavy atoms:
elementType: O O N C C C C C C C C C
charge: -0.344079 -0.129012 -0.095837 0.285411 0.139216 0.007849 0.193759 0.121351 0.250075 0.256973 0.270898 0.043395
polarizability: 1.28892917e+02 -1.62592874e+00 1.00437869e+02 8.84490796e-02 9.17810786e-01 8.52477310e+01
1716.lowfreq: -16.1123 -11.1065 -6.2295 -0.0008 -0.0006 -0.0006 38.5717 54.0240 81.0634
frequency: 38.2266 53.9972 81.0592 136.3882 156.3455 200.7151 221.1714 224.2662 256.0704 268.4924 292.0960 304.2850 344.8180 365.4238 393.6724 428.1757 444.2226 466.4400 491.1705 565.0016 580.0403 651.8646 711.8591 734.8633 789.0361 860.0775 878.2154 882.8031 915.4969 944.7308 981.7440 1007.0951 1036.1878 1054.2371 1067.4099 1085.9264 1088.5963 1115.5662 1121.1959 1159.8219 1164.8124 1206.4186 1223.8073 1236.2487 1255.3645 1255.8888 1286.6444 1300.2282 1318.8082 1345.8307 1384.1975 1392.1004 1419.0512 1426.8822 1431.0458 1443.5275 1452.1768 1460.6085 1462.4793 1469.1195 1473.7658 1475.4901 1482.2103 1489.4527 1505.8544 1687.4748 2961.4884 2966.3397 3004.9297 3006.2259 3019.2990 3022.4477 3024.2501 3027.1484 3094.7837 3101.2146 3108.7288 3113.9655 3136.3946 3139.5436 3142.5454 3145.1046 3150.6328 3154.1255
redmass: 3.3792 3.8965 3.6853 3.4511 2.5248 1.0456 1.0667 2.8477 2.4402 2.1606 1.5014 1.1089 2.2447 3.2540 2.5399 2.2029 2.9076 2.5693 2.6806 2.6366 7.0947 4.2060 3.6736 3.6917 3.0339 2.3867 3.3000 2.6528 2.5657 2.8959 1.4803 2.9922 2.4389 1.1990 1.8820 1.8981 2.0257 1.5004 1.7748 1.4912 2.0474 1.5498 1.5584 1.5465 1.2813 1.8592 1.4258 1.3593 1.3094 1.2827 1.3910 1.2010 1.1364 1.1579 1.1037 1.0880 1.0544 1.1285 1.0496 1.0511 1.0461 1.0500 1.0549 1.0514 1.0506 12.2135 1.0828 1.0847 1.0357 1.0645 1.0316 1.0334 1.0441 1.0458 1.0991 1.1065 1.0998 1.1018 1.1054 1.1054 1.1054 1.1050 1.1069 1.1067
irintensity: 0.8898 1.8022 7.7004 3.2793 1.2679 0.6760 0.6433 3.3862 2.2038 3.0380 0.9898 1.0688 0.9034 8.0907 0.8730 0.0881 11.3614 1.0601 4.3910 3.0266 0.1627 8.0867 3.8102 3.1534 10.3279 18.0385 67.9783 5.4468 22.9945 20.2126 17.0092 9.8551 60.6763 0.3111 25.4793 7.4130 34.1013 4.4513 1.2805 12.7259 27.7273 1.6106 3.4090 18.6762 8.9248 0.1246 1.5460 3.8261 0.2855 11.7524 10.0700 21.9015 19.2188 8.0337 12.9601 14.0747 2.1622 17.3424 16.9757 13.4432 2.8437 14.7175 34.3088 34.9306 70.9388 168.2060 12.9746 39.7543 7.3512 2.8558 14.8717 2.2856 6.0226 8.5352 0.5756 4.4951 8.4394 13.8671 1.2902 2.2569 4.9899 11.1779 2.3878 5.5598
temp: 298.150 k
press: 1.00000 atm
elementType: 8 8 7 6 6 6 6 6 6 6 6 6 1 1 1 1 1 1 1 1 1 1 1 1 1 1 1 1 1 1
symmnumber: 1
zpe: 692443.2 jmol-1
zpe.correction: 0.263738 hartree
zpe.thermalcorrener: 0.277345 hartree
zpe.thermalcorrenthalpy: 0.278289 hartree
zpe.thermalcorrgfe: 0.223949 hartree
zpe.sumelectzpe: -557.708457 hartree
zpe.sumelectthermal: -557.694850 hartree
zpe.sumelectthermalent: -557.693905 hartree
zpe.sumelectthermalfe: -557.748246 hartree
dipole: 10.1196 -0.2145 0.2540
dipole: 10.1250
quadrupole: -47.6820 -62.6692 -63.5560
quadrupole: -6.0598 -1.9291 -0.2174
quadrupole: 10.2870 -4.7001 -5.5869 -6.0598 -1.9291 -0.2174
hfenergy: -557.9721945 hartree
pointgroup: C01 [X(C9H18N1O2)]
dipole: 3.9824555 -0.069814 0.058604 debye
polarizability: 128.9114081|-1.371743|99.6605922|-0.4911877|3.4322934|86.0065159 unknown
InChI: InChI=1S/C9H18NO2/c1-7-9(11)5-8(12-7)6-10(2,3)4/h7-8H,5-6H2,1-4H3
charge 1 multiplicity 1
30 atoms
O  -0.478182 0.667945 0.347792
O  -3.633641 -0.957607 -0.243582
N  2.4179 0.093344 -0.051697
C  -0.042798 -0.748916 0.212902
C  1.259497 -0.793303 -0.5916
C  -1.209441 -1.474949 -0.487676
C  -1.95283 0.670763 0.580243
C  -2.443339 -0.639183 -0.073591
C  2.495185 0.044667 1.473142
C  3.728476 -0.431328 -0.640218
C  2.221074 1.549401 -0.499067
C  -2.582512 1.936214 -0.00069
H  0.106695 -1.180403 1.225004
H  1.084432 -0.461075 -1.629205
H  1.636569 -1.831074 -0.605725
H  -1.338925 -2.528043 -0.190229
H  -1.129019 -1.440434 -1.591597
H  -2.141372 0.60739 1.673923
H  2.553132 -1.003923 1.803562
H  3.400655 0.583286 1.792204
H  1.602568 0.534502 1.887433
H  3.634166 -0.487914 -1.735568
H  4.542344 0.260326 -0.374428
H  3.938381 -1.430795 -0.229469
H  1.222172 1.872997 -0.175914
H  3.011933 2.163854 -0.041311
H  2.300457 1.593998 -1.596412
H  -2.365039 2.030501 -1.077953
H  -3.677273 1.882676 0.129423
H  -2.211964 2.833783 0.521102
