program: Gaussian 09
title: 000155663
version: EM64L-G09RevD.01
frameworkgroup: C1[X(C8H16O2)]
method: RPBEPBE
basis: SDD
operation: Freq
keyword: #pfreq=noraman
keyword: PBEPBE/SDD
title: #p freq=noraman PBEPBE/SDD
converged: YES YES NO NO
title: Mulliken charges:
elementType: O O C C C C C C C C H H H H H H H H H H H H H H H H
charge: -0.452609 -0.221961 -0.178714 -0.055929 -0.372264 0.230893 -0.732853 -0.502395 -0.705242 -0.676882 0.203243 0.190392 0.223972 0.218169 0.245348 0.205516 0.226361 0.219618 0.276236 0.218228 0.198209 0.243024 0.335391 0.227660 0.227805 0.208785
chargesum: 0.00000
title: Mulliken charges with hydrogens summed into heavy atoms:
elementType: O O C C C C C C C C
charge: -0.117218 -0.221961 0.024529 0.134464 0.069877 0.230893 -0.055628 -0.006541 -0.045782 -0.012631
polarizability: 9.89544649e+01 -2.82395722e+00 8.94875419e+01 -4.63030042e-01 -2.24488956e+00 8.80239762e+01
1716.lowfreq: -0.0004 -0.0004 -0.0003 4.3182 10.5478 13.1960 38.2111 68.5368 83.4113
frequency: 37.9822 68.4817 83.4109 95.3597 141.8921 174.7706 185.4514 194.0283 216.6565 251.1130 267.6717 296.6315 315.1780 342.6642 408.7135 446.1061 493.9954 589.1227 640.5170 743.6809 763.0573 803.1749 859.0746 920.2831 930.4572 973.4562 1004.6182 1020.7300 1049.0949 1050.3694 1085.9167 1096.5617 1106.0173 1111.4184 1142.7119 1203.5689 1224.4868 1248.1941 1282.6967 1296.6428 1321.3384 1336.9299 1355.1385 1384.2382 1389.9996 1395.8579 1398.9303 1441.4084 1447.9900 1464.4743 1469.2391 1476.9253 1477.8773 1483.2340 1488.4227 1623.9250 2934.6612 2953.8884 2965.1392 2979.4734 2989.9370 2995.2873 2999.4064 3000.8092 3052.0626 3073.8409 3081.8184 3091.5060 3095.2389 3095.7136 3101.4518 3556.5367
redmass: 4.1101 2.0381 2.2980 2.7325 2.4741 1.4293 1.3699 1.4703 1.6170 1.9236 2.7009 2.1932 1.3952 4.1017 2.9165 3.1200 3.0480 2.6430 2.5388 2.2561 1.6362 1.4881 1.8316 2.1605 2.5699 2.7235 1.5107 1.6729 1.7205 1.9257 1.6283 1.9258 2.3092 1.9000 2.3754 1.4330 1.2968 1.2134 1.1833 1.1981 1.4534 1.4992 1.6080 1.3675 1.2017 1.2113 1.4193 1.0944 1.0854 1.0482 1.0396 1.0429 1.0505 1.0508 1.0549 7.5996 1.0843 1.0635 1.0797 1.0370 1.0377 1.0366 1.0756 1.0814 1.0986 1.0996 1.0990 1.1003 1.1001 1.0996 1.0989 1.0661
irintensity: 2.1071 1.6386 1.7408 2.3910 1.4379 0.9994 0.2925 0.6794 0.2892 3.3541 1.5561 23.6268 149.1761 7.4862 3.5370 0.8320 9.5917 5.1388 0.9965 2.5313 1.7266 9.7892 6.5030 37.9628 59.0627 42.3051 3.2541 3.6237 5.5689 2.4987 14.5002 8.5158 8.0181 12.6222 38.9515 32.4039 5.4226 7.9036 5.7730 11.2010 5.0719 22.8873 17.8041 5.5394 23.0604 21.4544 23.2265 27.3594 2.4359 10.9252 11.2263 10.0894 14.0057 12.8347 14.6337 84.7111 52.2490 7.0093 37.4874 38.3792 33.8173 28.3986 9.2063 17.3765 5.7718 52.3895 30.2717 28.8052 28.2062 29.9784 24.6041 5.9092
temp: 298.150 k
press: 1.00000 atm
elementType: 8 8 6 6 6 6 6 6 6 6 1 1 1 1 1 1 1 1 1 1 1 1 1 1 1 1
symmnumber: 1
zpe: 592681.8 jmol-1
zpe.correction: 0.225741 hartree
zpe.thermalcorrener: 0.238826 hartree
zpe.thermalcorrenthalpy: 0.239770 hartree
zpe.thermalcorrgfe: 0.186396 hartree
zpe.sumelectzpe: -464.057760 hartree
zpe.sumelectthermal: -464.044674 hartree
zpe.sumelectthermalent: -464.043730 hartree
zpe.sumelectthermalfe: -464.097104 hartree
dipole: -1.0355 0.4726 3.3503
dipole: 3.5383
quadrupole: -63.0546 -65.2199 -60.6006
quadrupole: -3.8841 3.4956 3.3987
quadrupole: -0.0963 -2.2615 2.3578 -3.8841 3.4956 3.3987
hfenergy: -464.2835003 hartree
pointgroup: C01 [X(C8H16O2)]
dipole: 0.3854992 -0.1298165 -1.3313371 debye
dipolederiv: -0.6663184 0.0694181 0.0060706 0.1118291 -0.7752771 -0.2556758 -0.013461 -0.2381327 -0.2430632 -0.539552 -0.0591244 0.1343183 -0.066149 -0.5653377 -0.1847249 0.2139485 -0.2363513 -0.6388227 -0.4499633 0.0655323 0.193248 -0.0147198 -0.0993127 -0.0252612 0.1188883 0.0474218 0.013245 0.5313113 -0.0677265 -0.0041915 -0.1626217 0.6423697 0.220851 0.1081673 0.147253 0.3417874 0.0524523 0.0355926 -0.0163083 0.0571836 0.0730001 0.0135306 -0.0216746 -0.0291702 -0.0395797 0.7977507 0.305114 -0.237906 0.4057361 0.5633674 0.2556068 -0.3868499 0.3134796 0.6010093 0.019494 -0.001529 -0.018709 0.0047014 -0.03765 -0.0356899 0.0204855 0.0096149 0.0316135 -0.0907476 -0.1701563 0.0105031 -0.2016126 -0.2415825 -0.1488614 -0.0504022 -0.188769 -0.0069286 -0.0053407 0.0683677 -0.0242294 0.0487115 0.0452406 -0.007536 -0.0643597 0.0184349 0.0501227 -0.0019529 -0.0326 0.0581539 -0.0307657 0.0703336 0.0321302 0.0546019 0.0288567 0.0137011 0.0161863 -0.0073488 -0.0756233 -0.0301255 -0.0008187 -0.0667956 -0.0651882 -0.0615732 -0.1480322 -0.1557389 -0.0791231 0.1090852 -0.0731956 -0.0612995 0.0118291 0.0736069 0.0487178 -0.0491802 -0.0836463 -0.0693387 0.0577629 -0.0779014 0.0228148 0.0645321 0.0532023 0.0378666 0.0304146 0.0632048 0.0237448 -0.0038206 0.0326893 -0.1085192 -0.0790759 0.0073882 -0.0678511 0.0562852 0.0987474 -0.0137468 -0.0392559 -0.0239079 0.0919916 -0.0135255 -0.0723526 -0.0757167 -0.0699008 -0.0866008 -0.0869979 0.1307374 -0.0380581 0.0551786 0.0111468 0.1206612 0.0417368 0.0122501 -0.0417951 0.129712 -0.074468 0.0827162 -0.0253392 0.0427738 -0.0603047 0.0528949 0.0708432 0.044193 -0.0429824 -0.04933 -0.0002884 0.0727535 0.0806816 -0.0218675 0.067454 -0.1165402 0.0779213 0.0471134 0.0062541 0.0484418 0.0468917 -0.0226839 0.0492241 0.0231418 0.0932274 0.0339085 0.0259484 -0.0593384 0.0263101 0.0915362 0.0243461 -0.1065635 0.0430192 -0.1699223 -0.0741586 -0.0703535 0.0540098 -0.1183929 -0.0080607 0.0716834 0.1120259 0.0730938 0.0373986 0.084711 -0.0061897 0.0031646 0.0443551 -0.0950745 -0.0637719 0.0377046 -0.1011994 0.0763719 0.3613675 -0.0564806 -0.0774525 -0.0456729 0.2754303 0.1093098 -0.0580563 0.0445448 0.0040649 -0.0185314 0.0815853 0.0270494 0.1514071 -0.0324102 -0.0226935 0.0389134 0.0062787 0.0790934 0.0436272 0.0318058 -0.0995876 0.0225522 0.0884029 0.0312122 -0.0504006 0.0662099 -0.0939634 -0.010529 -0.1202365 -0.0101368 -0.1532219 -0.0886287 -0.0433381 -0.0373374 -0.0712555 0.064505 unknown
polarizability: 98.9479783|2.612134|90.3965816|-1.2889135|1.6322017|87.1214231 unknown
InChI: InChI=1S/C8H16O2/c1-4-7(9)6(3)8(10)5-2/h6-7,9H,4-5H2,1-3H3
charge 0 multiplicity 1
26 atoms
O  1.030956 -1.437376 -1.117929
O  -1.407095 1.162894 1.035024
C  -0.016097 0.854949 -0.950964
C  1.241541 -0.046097 -0.658186
C  1.631314 -0.146583 0.825093
C  -1.183482 0.492146 -0.009651
C  0.345282 2.35237 -0.853624
C  -2.017761 -0.728364 -0.387196
C  3.02107 -0.784029 1.027425
C  -3.099385 -1.095115 0.642015
H  -0.326264 0.620693 -1.992122
H  2.08549 0.402401 -1.230077
H  0.862726 -0.746954 1.348185
H  1.601078 0.863025 1.275439
H  0.557799 2.636407 0.190419
H  1.228489 2.586654 -1.47678
H  -0.494043 2.982498 -1.19621
H  -2.469555 -0.531677 -1.383364
H  -1.303292 -1.562186 -0.552709
H  3.258185 -0.880266 2.102362
H  3.815078 -0.169544 0.561135
H  3.053463 -1.789198 0.573217
H  0.975773 -1.447301 -2.107269
H  -3.807772 -0.261479 0.788367
H  -2.647087 -1.310969 1.625459
H  -3.664512 -1.985798 0.313841
