program: Gaussian 09
title: 000155653
version: EM64L-G09RevD.01
frameworkgroup: C1[X(C5H11NO2S)]
method: RPBEPBE
basis: SDD
operation: Freq
keyword: #p
keyword: freq=noraman
keyword: PBEPBE/SDD
title: #p freq=noraman PBEPBE/SDD
converged: YES YES NO NO
title: Mulliken charges:
elementType: S O O N C C C C C H H H H H H H H H H H
charge: 0.187728 -0.482049 -0.268302 -0.336778 -0.363226 -0.299630 0.302267 -0.807624 -0.874015 0.233105 0.250930 0.324943 0.202397 0.228035 0.297395 0.256014 0.258289 0.246658 0.288375 0.355489
chargesum: 0.00000
title: Mulliken charges with hydrogens summed into heavy atoms:
elementType: S O O N C C C C C
charge: 0.187728 -0.126560 -0.268302 -0.011835 0.120808 0.130802 0.302267 -0.254215 -0.080693
polarizability: 8.99062751e+01 2.89788533e-01 9.45988877e+01 -3.53763059e+00 3.15761517e+00 6.69797263e+01
1716.lowfreq: -13.2885 -9.8892 -5.3081 -0.0020 -0.0009 0.0017 18.9690 46.3809 65.7288
frequency: 17.9494 46.2961 65.6728 97.2483 120.7379 191.0058 200.2311 238.8793 263.0687 284.5687 329.3807 405.5348 485.4912 569.8293 596.1588 643.0643 660.7109 744.5097 793.6344 857.4841 889.9851 932.0231 971.4065 988.6728 1032.0124 1076.4381 1092.9339 1142.4552 1188.1651 1204.7925 1230.4599 1262.2968 1290.3743 1348.0582 1365.1136 1391.8539 1425.4867 1435.9721 1451.2569 1473.1351 1481.6637 1489.5850 1620.0641 2963.8476 2987.0146 3015.5569 3020.2797 3034.9166 3095.0525 3102.2378 3119.1873 3125.5641 3562.9284 3587.4031
redmass: 3.8735 6.6414 3.8241 3.1777 3.5964 3.4955 1.4382 2.4076 1.8468 1.7675 2.0624 2.3266 2.6354 4.5520 1.2632 4.8678 6.8533 6.2807 2.0597 2.0940 2.5267 2.6394 1.1866 1.3288 3.3783 2.0486 1.9085 1.2080 1.3150 1.1198 1.2017 1.8213 1.2468 1.1345 1.3066 1.4266 1.1209 1.1104 1.0543 1.0803 1.0634 1.7813 6.8317 1.0560 1.0296 1.0761 1.0631 1.0920 1.1029 1.1061 1.1017 1.1016 1.0776 1.0667
irintensity: 6.5197 4.3403 2.6593 3.9346 16.1032 9.6837 2.3685 0.8119 49.5410 112.1238 16.8931 13.4974 12.7585 13.3951 126.0634 9.3016 1.8193 0.1796 6.0111 9.0546 10.7373 17.8038 4.0053 7.7664 46.4725 18.4524 11.6503 20.8863 41.2402 2.2052 4.1044 28.1053 59.5168 2.5226 4.1715 1.0736 29.6212 22.2958 19.1768 7.9505 17.2365 155.6187 194.3451 61.5625 21.9657 3.0471 23.6284 89.9816 5.8643 13.3045 6.1649 1.6235 17.5961 5.3443
temp: 298.150 k
press: 1.00000 atm
elementType: 16 8 8 7 6 6 6 6 6 1 1 1 1 1 1 1 1 1 1 1
symmnumber: 1
zpe: 424732.0 jmol-1
zpe.correction: 0.161772 hartree
zpe.thermalcorrener: 0.173332 hartree
zpe.thermalcorrenthalpy: 0.174276 hartree
zpe.thermalcorrgfe: 0.122317 hartree
zpe.sumelectzpe: -799.646345 hartree
zpe.sumelectthermal: -799.634784 hartree
zpe.sumelectthermalent: -799.633840 hartree
zpe.sumelectthermalfe: -799.685799 hartree
dipole: -2.4644 3.6254 1.7022
dipole: 4.7026
quadrupole: -58.1078 -64.5807 -61.7991
quadrupole: -2.1271 6.7856 -6.3427
quadrupole: 3.3881 -3.0849 -0.3033 -2.1271 6.7856 -6.3427
hfenergy: -799.8081165 hartree
pointgroup: C01 [X(C5H11N1O2S1)]
dipole: -1.1336763 1.3421317 0.580071 debye
dipolederiv: -0.1745894 -0.0534864 -0.1311922 -0.0608144 -0.1278272 -0.0207557 -0.1133262 -0.0099898 -0.0470164 -0.6305959 -0.0288664 0.121824 -0.0403367 -0.739417 -0.1451243 0.1686149 -0.183412 -0.2774339 -0.6134723 -0.123757 -0.0342565 0.1539373 -0.8429629 -0.2520319 0.0976896 -0.4006621 -0.5239382 -1.0088836 0.2195542 0.1707586 0.1794589 -0.4601906 0.025289 0.2171469 -0.0353763 -0.5923004 0.5277772 -0.019288 0.0059996 0.154689 0.0835678 -0.0947736 0.0724921 -0.0332426 0.2420417 0.3054272 0.0107372 -0.0284697 0.0200121 0.6257722 0.1722149 -0.058787 0.1212187 0.2062642 1.2539576 0.0265526 -0.2177441 -0.3067753 0.9130355 0.5006294 -0.2867985 0.6860316 0.445793 -0.1795579 -0.0700532 0.0117068 -0.0440225 0.0420077 -0.1187514 0.0008302 -0.0647803 0.1369904 0.0020087 -0.0348352 0.0341539 -0.0920044 0.0488591 0.080777 0.0498388 0.0592857 0.034089 -0.0829041 0.0061084 0.0731572 0.0281214 0.1186289 -0.0133954 0.0939186 0.0328304 -0.0787949 0.1209163 0.0393677 -0.004689 -0.0691748 -0.0169455 -0.028594 -0.0679491 -0.045231 0.0885168 0.1445402 -0.0020123 -0.0277863 -0.0212003 0.160065 -0.1177066 -0.0633967 -0.0885094 0.29822 -0.2279934 -0.0646913 -0.0910407 -0.0131421 -0.0256374 -0.0386904 -0.0876575 -0.0387647 0.055294 0.0174473 0.0089592 0.1335373 -0.0005731 -0.0274791 -0.0218652 0.0860249 -0.0460244 -0.098022 0.0261895 0.0190222 0.0002404 0.0696112 -0.0050075 0.0138482 0.0266822 0.0045684 0.1128247 0.0464324 -0.0504335 0.059348 -0.0547149 0.028094 -0.0461677 -0.023215 -0.0014776 -0.1412203 0.085907 -0.0395354 0.0273819 -0.0402817 -0.0774768 0.0633818 0.0437129 0.0711991 0.0852317 0.0614605 0.0652374 0.0050899 0.0497797 0.0473551 -0.0151621 -0.0115013 -0.0851409 -0.1530317 -0.0303677 0.0532929 -0.0095048 0.044651 0.062474 -0.0335149 0.0003482 -0.0682169 0.0611563 0.3563005 0.0381269 -0.0985143 0.0427797 0.1930847 0.0903932 -0.1446682 0.1256942 0.1453359 unknown
polarizability: 90.0070324|-0.4783122|94.8216533|-3.5206356|1.183573|66.6562034 unknown
InChI: InChI=1S/C5H11NO2S/c1-9-4-5(8)6-2-3-7/h6-7H,2-4H2,1H3
charge 0 multiplicity 1
20 atoms
S  2.442199 0.781469 -0.563267
O  -2.2538 1.530498 -0.153823
O  0.385108 -2.196603 -0.614894
N  -0.550161 -0.542836 0.735241
C  -1.931422 -0.807787 0.317828
C  -2.396286 0.186231 -0.75428
C  0.527499 -1.210093 0.17024
C  1.896459 -0.653991 0.558361
C  1.396763 2.183921 0.142503
H  -2.599129 -0.740164 1.195425
H  -1.967114 -1.832876 -0.088476
H  -0.386027 0.305223 1.279389
H  -3.454184 -0.019152 -1.019201
H  -1.763644 0.089797 -1.658961
H  2.654372 -1.434702 0.396398
H  1.939355 -0.307077 1.6061
H  1.756077 3.0999 -0.353353
H  1.569499 2.277152 1.228487
H  0.325732 2.040606 -0.075281
H  -2.577295 2.216888 -0.788037
