program: Gaussian 09
title: 000155652
version: EM64L-G09RevD.01
frameworkgroup: C1[X(C13H11Cl2O2PS)]
method: RPBEPBE
basis: SDD
operation: Freq
keyword: #p
keyword: freq=noraman
keyword: PBEPBE/SDD
title: #p freq=noraman PBEPBE/SDD
converged: YES YES NO NO
title: Mulliken charges:
elementType: Cl Cl S P O O C C C C C C C C C C C C C H H H H H H H H H H H
charge: -0.029441 -0.015798 -0.198570 0.642282 -0.450532 -0.469735 0.000472 -0.241309 -0.318031 0.558125 -0.215578 -0.211914 -0.231968 -0.208972 -0.219365 -0.228401 -0.225056 -0.213569 -0.476409 0.274592 0.281095 0.236922 0.237294 0.235270 0.260216 0.259788 0.240861 0.240808 0.239975 0.246947
chargesum: 0.00000
title: Mulliken charges with hydrogens summed into heavy atoms:
elementType: Cl Cl S P O O C C C C C C C C C C C C C
charge: -0.029441 -0.015798 -0.198570 0.642282 -0.450532 -0.469735 0.000472 0.033282 -0.036935 0.558125 0.021344 0.025380 -0.231968 -0.208972 0.015905 0.031815 0.034732 0.027292 0.251322
polarizability: 2.62903669e+02 -1.42404983e+01 2.03319432e+02 -1.87727171e+01 -2.15163723e+01 1.54180074e+02
1716.lowfreq: -8.9365 0.0018 0.0018 0.0021 5.2819 9.2813 11.6339 29.5142 43.2030
frequency: 11.1864 29.4162 43.1823 52.5721 65.9479 85.9328 96.4902 104.3747 121.1421 151.4080 158.7923 195.2034 198.6309 199.9800 240.8256 261.8146 276.3720 301.4293 337.8485 370.3194 382.6531 396.3147 411.1808 453.8001 496.2369 508.9642 511.4468 548.5517 581.3590 608.9593 624.0114 675.7909 694.5810 707.3999 727.2412 739.8241 762.5118 769.7023 829.7850 855.5673 888.9129 934.3554 961.1391 970.3168 982.5042 986.3259 1003.2474 1021.5062 1044.9789 1068.6631 1082.5177 1092.6296 1117.2140 1134.7884 1154.4331 1176.3891 1192.6470 1193.1529 1223.3630 1315.6724 1354.0098 1382.8111 1419.8598 1421.5680 1422.7244 1428.7481 1454.5695 1467.1107 1476.8044 1559.2362 1580.6506 1588.3835 1596.0709 2985.8873 3094.3245 3130.4799 3133.0686 3141.5611 3152.9078 3154.0771 3165.6813 3172.1313 3176.8355 3184.3478
redmass: 7.4839 4.9275 6.1878 9.0028 8.3112 11.4147 1.8457 3.2995 1.9185 5.9017 11.8656 4.8292 6.3517 7.5233 8.5725 8.5598 6.7565 6.6251 7.1392 11.5297 8.0339 2.8210 8.7179 6.7665 4.5799 5.3458 7.2575 4.9255 7.6357 6.5413 10.4117 10.4359 2.0292 7.0965 5.0479 8.1943 1.5911 1.4243 6.9810 1.2460 1.3535 1.3664 1.3256 10.9038 1.3909 6.2431 1.3260 2.9869 5.3521 2.5114 1.6203 2.7295 1.2435 1.3031 1.3919 1.0542 1.4466 1.1263 3.0185 1.3030 8.6462 8.8585 2.3383 3.0852 1.1595 2.1204 1.0514 2.0361 1.0514 7.0353 7.6808 6.0777 5.8898 1.0305 1.1028 1.1044 1.0856 1.0894 1.0933 1.0870 1.0975 1.0929 1.0996 1.0998
irintensity: 0.6604 0.4300 1.3603 0.6199 0.8805 1.2439 1.5582 0.4439 1.4358 6.6008 2.5492 0.3667 2.2090 4.1796 4.2911 5.6613 9.1874 4.5342 14.3444 1.9067 2.7078 0.1620 9.4395 42.9720 69.8500 0.8004 11.8583 19.7724 51.0454 1.0947 69.9401 77.1780 54.5395 20.1482 56.4850 82.4610 32.8584 55.0251 86.1753 0.1308 0.0061 0.7451 0.9432 151.9490 0.0604 2.8568 0.0796 2.2257 13.1839 16.4338 5.3731 35.6809 0.4010 0.3491 5.3385 0.0434 9.4544 8.7976 118.1018 4.8707 6.5932 1.1007 60.4886 106.3547 8.3299 21.0788 11.0507 9.1551 17.5091 28.9438 2.4496 0.6635 0.0577 47.7449 12.7312 10.4893 0.3833 3.8932 12.3013 3.0464 19.2010 1.2548 15.4316 7.6359
temp: 298.150 k
press: 1.00000 atm
elementType: 17 17 16 15 8 8 6 6 6 6 6 6 6 6 6 6 6 6 6 1 1 1 1 1 1 1 1 1 1 1
symmnumber: 1
zpe: 542969.2 jmol-1
zpe.correction: 0.206806 hartree
zpe.thermalcorrener: 0.226403 hartree
zpe.thermalcorrenthalpy: 0.227347 hartree
zpe.thermalcorrgfe: 0.155546 hartree
zpe.sumelectzpe: -2310.462748 hartree
zpe.sumelectthermal: -2310.443151 hartree
zpe.sumelectthermalent: -2310.442207 hartree
zpe.sumelectthermalfe: -2310.514008 hartree
dipole: 0.1902 -0.6095 -0.9915
dipole: 1.1793
quadrupole: -112.3397 -127.3743 -144.7947
quadrupole: 1.0765 -5.1989 -1.9982
quadrupole: 15.8299 0.7953 -16.6251 1.0765 -5.1989 -1.9982
hfenergy: -2310.6695539 hartree
pointgroup: C01 [X(C13H11Cl2O2P1S1)]
dipole: -0.0186369 -0.1153518 0.4490256 debye
polarizability: 253.9342332|16.6088858|216.1857654|-30.7046836|-3.4474153|150.2831766 unknown
InChI: InChI=1S/C13H11Cl2O2PS/c1-16-18(19,10-6-3-2-4-7-10)17-13-11(14)8-5-9-12(13)15/h2-9H,1H3
charge 0 multiplicity 1
30 atoms
Cl 2.480919 2.908426 -0.029299
Cl 0.574922 -2.298039 0.622751
S  -0.254765 -0.184067 -2.685273
P  -0.907749 0.64981 -0.915908
O  0.369081 0.754792 0.385747
O  -1.425035 2.30052 -0.954853
C  -2.33305 -0.081808 -0.011735
C  -2.954848 0.64233 1.03306
C  -2.786913 -1.365748 -0.386663
C  1.652909 0.249415 0.231865
C  -4.049835 0.061982 1.709362
C  -3.884976 -1.934301 0.295019
C  2.765065 1.118042 0.066557
C  1.941304 -1.13878 0.343588
C  -4.514324 -1.223477 1.343095
C  4.087882 0.644143 0.000968
C  3.252546 -1.642518 0.275891
C  4.327814 -0.744082 0.099558
C  -0.760657 3.249963 -1.875088
H  -2.596908 1.64057 1.300558
H  -2.290903 -1.903868 -1.202061
H  -4.539205 0.61348 2.519065
H  -4.245162 -2.928013 0.009048
H  -5.365016 -1.667844 1.871549
H  4.912569 1.351008 -0.124308
H  3.426757 -2.718184 0.365381
H  5.352138 -1.124548 0.045444
H  -0.647243 2.799895 -2.878663
H  -1.43846 4.115655 -1.9156
H  0.223943 3.543149 -1.474953
