program: Gaussian 09
title: 000155646
version: EM64L-G09RevD.01
frameworkgroup: C1[X(C13H11Cl2O2PS)]
method: RPBEPBE
basis: SDD
operation: Freq
keyword: #p
keyword: freq=noraman
keyword: PBEPBE/SDD
title: #p freq=noraman PBEPBE/SDD
converged: NO YES NO NO
title: Mulliken charges:
elementType: Cl Cl S P O O C C C C C C C C C C C C C H H H H H H H H H H H
charge: -0.014785 -0.010990 -0.180583 0.620290 -0.497340 -0.467067 0.009009 -0.256624 -0.323479 0.429433 -0.211587 -0.205888 -0.293070 -0.384017 -0.217311 -0.040908 -0.163223 -0.127672 -0.472156 0.277125 0.282244 0.239812 0.240701 0.283222 0.259060 0.238682 0.260022 0.240701 0.242306 0.244092
chargesum: 0.00000
title: Mulliken charges with hydrogens summed into heavy atoms:
elementType: Cl Cl S P O O C C C C C C C C C C C C C
charge: -0.014785 -0.010990 -0.180583 0.620290 -0.497340 -0.467067 0.009009 0.020501 -0.041235 0.429433 0.028225 0.034814 -0.009849 -0.124957 0.021371 -0.040908 0.096798 -0.127672 0.254943
polarizability: 2.34251662e+02 8.12483772e+00 2.11301938e+02 -9.54144873e+00 1.55707523e+01 1.77526346e+02
1716.lowfreq: -12.4513 -6.7088 -4.7456 -0.0030 -0.0020 0.0004 6.5658 7.1659 14.3359
frequency: -7.6084 6.4026 13.9212 49.9862 69.5159 85.9037 94.7492 105.0806 115.3823 145.3721 163.5935 182.3048 193.2771 213.0471 231.9939 276.4573 290.1233 306.4695 326.4304 375.9573 394.0514 400.2315 434.2037 437.3974 451.1842 489.7998 539.3956 568.7996 588.5544 609.0716 646.3610 679.0383 685.2571 694.6299 706.2306 708.1656 763.0814 809.3502 842.9584 855.8684 870.1472 935.1487 943.6635 964.4665 984.3152 986.0835 996.8158 1007.1023 1020.2736 1081.6435 1091.6972 1112.4199 1113.0921 1128.4514 1131.4400 1177.4930 1191.1076 1200.0473 1251.6875 1313.9860 1353.9030 1383.3782 1387.0099 1419.3672 1428.8417 1450.0348 1455.4962 1465.3791 1471.0767 1567.6989 1587.2100 1589.9267 1594.4761 2986.3934 3090.9006 3132.1715 3132.9567 3139.3284 3152.5592 3163.1210 3164.9852 3174.2585 3175.3630 3184.3405
redmass: 7.7127 4.2221 7.4698 7.9217 3.5883 7.8223 5.0950 7.6528 1.0952 5.8969 6.2304 24.6019 6.4961 9.6890 7.6703 5.4880 7.3397 7.8933 7.8810 8.3308 2.8171 11.3153 4.4510 4.7822 6.2565 4.0794 8.5896 6.5791 8.0498 6.5268 7.8949 3.2027 9.1443 2.1377 9.2495 8.1597 1.5894 1.3497 1.6554 1.2510 7.8672 1.3597 1.3434 10.8933 1.3922 6.1989 5.0876 1.3299 2.9412 1.6302 2.7538 1.8943 1.3057 1.2880 1.3096 1.0554 1.1695 3.8505 1.4103 1.3097 5.2673 8.8399 4.9503 1.1230 2.1172 2.6214 1.0565 2.0312 1.0522 8.1510 6.1096 7.2364 5.8904 1.0297 1.1048 1.0876 1.1035 1.0885 1.0920 1.0888 1.0965 1.0928 1.1009 1.0974
irintensity: 0.1630 0.2584 0.1295 0.3964 3.2295 0.3942 1.0416 0.7377 0.3092 6.5136 2.6565 0.3857 0.0494 4.3484 6.3428 10.1709 4.1789 2.1694 9.0601 9.2182 0.3107 2.8704 17.0998 23.5091 6.3167 34.7491 41.6165 52.8011 41.7203 2.5180 109.7523 0.8714 71.3780 74.9188 69.6478 92.0424 27.4346 23.9637 37.7395 0.2793 127.9630 0.4924 0.2677 173.7146 0.2439 2.3805 50.2166 0.0330 1.3808 6.2661 45.0707 69.6062 10.2374 2.4470 0.1701 0.0583 25.0896 163.2821 28.8391 5.1832 19.2199 0.9454 8.5721 4.6051 21.9612 235.1744 23.7564 7.1409 17.8870 37.2624 2.2468 43.7717 0.5243 47.3579 21.9609 0.7898 14.5806 1.1890 9.2392 1.8147 14.3836 1.1306 18.6627 2.0849
temp: 298.150 k
press: 1.00000 atm
elementType: 17 17 16 15 8 8 6 6 6 6 6 6 6 6 6 6 6 6 6 1 1 1 1 1 1 1 1 1 1 1
symmnumber: 1
zpe: 542511.6 jmol-1
zpe.correction: 0.206632 hartree
zpe.thermalcorrener: 0.225426 hartree
zpe.thermalcorrenthalpy: 0.226370 hartree
zpe.thermalcorrgfe: 0.155447 hartree
zpe.sumelectzpe: -2310.463818 hartree
zpe.sumelectthermal: -2310.445024 hartree
zpe.sumelectthermalent: -2310.444080 hartree
zpe.sumelectthermalfe: -2310.515003 hartree
dipole: 3.6206 -0.1990 -2.8727
dipole: 4.6261
quadrupole: -143.4649 -119.7735 -139.2658
quadrupole: 10.9788 -1.3712 4.7721
quadrupole: -9.2968 14.3945 -5.0977 10.9788 -1.3712 4.7721
hfenergy: -2310.67045 hartree
pointgroup: C01 [X(C13H11Cl2O2P1S1)]
dipole: 1.2536209 -0.1899072 1.3057205 debye
polarizability: 227.7412478|-13.8084089|211.7712486|17.4869543|14.7288342|183.5674492 unknown
InChI: InChI=1S/C13H11Cl2O2PS/c1-16-18(19,11-5-3-2-4-6-11)17-10-7-8-12(14)13(15)9-10/h2-9H,1H3
charge 0 multiplicity 1
30 atoms
Cl -3.307702 -1.499094 -1.969594
Cl -5.504793 0.540435 -0.602255
S  1.563309 1.214433 -2.351984
P  1.761838 0.741208 -0.356234
O  0.357303 1.163487 0.676775
O  2.916136 1.615005 0.589704
C  2.176229 -0.991391 0.107748
C  2.323352 -1.326694 1.475518
C  2.335587 -1.960751 -0.907824
C  -0.98643 0.985816 0.302176
C  2.635275 -2.658344 1.82365
C  2.645513 -3.290741 -0.546876
C  -1.415388 -0.04068 -0.571196
C  -1.922478 1.868565 0.889516
C  2.794875 -3.639046 0.815505
C  -2.790657 -0.175182 -0.847082
C  -3.29403 1.714436 0.610517
C  -3.73345 0.694977 -0.261585
C  2.952645 3.089867 0.449695
H  2.198379 -0.561038 2.247111
H  2.223076 -1.672997 -1.959751
H  2.752324 -2.930277 2.877847
H  2.770922 -4.049447 -1.32622
H  -0.704533 -0.729251 -1.03498
H  -1.568499 2.657486 1.558277
H  3.034746 -4.671627 1.091834
H  -4.028546 2.387665 1.061351
H  2.041508 3.53805 0.882018
H  3.053314 3.375757 -0.613209
H  3.842875 3.399675 1.016349
