program: Gaussian 09
title: 000155644
version: EM64L-G09RevD.01
frameworkgroup: C1[X(C13H12ClO2PS)]
method: RPBEPBE
basis: SDD
operation: Freq
keyword: #p
keyword: freq=noraman
keyword: PBEPBE/SDD
title: #p freq=noraman PBEPBE/SDD
converged: NO YES NO NO
title: Mulliken charges:
elementType: Cl S P O O C C C C C C C C C C C C C H H H H H H H H H H H H
charge: -0.065684 -0.185808 0.624853 -0.501671 -0.468337 0.009471 -0.257845 -0.323894 0.426530 -0.212034 -0.206686 -0.218177 -0.295847 -0.386581 -0.059078 -0.169833 -0.260009 -0.472222 0.276846 0.282427 0.238821 0.239774 0.237577 0.277748 0.253121 0.234792 0.257673 0.240386 0.240980 0.242706
chargesum: 0.00000
title: Mulliken charges with hydrogens summed into heavy atoms:
elementType: Cl S P O O C C C C C C C C C C C C C
charge: -0.065684 -0.185808 0.624853 -0.501671 -0.468337 0.009471 0.019001 -0.041466 0.426530 0.026788 0.033088 0.019400 -0.018099 -0.133459 -0.059078 0.064959 -0.002336 0.251850
polarizability: 2.05675166e+02 1.32903006e+01 2.10292828e+02 -9.41337844e+00 1.61448626e+01 1.70612562e+02
1716.lowfreq: -12.3218 -9.8341 -5.5671 -0.0023 -0.0009 -0.0007 5.9822 9.2866 16.6070
frequency: -7.2020 8.3305 16.4113 54.1145 69.6263 87.7856 97.3752 143.5607 147.0544 160.2031 183.9555 200.4712 233.1181 252.0847 273.7785 294.4895 313.0645 369.5426 383.9861 393.9319 431.8789 436.9861 487.8074 505.6319 561.7368 569.7960 608.2503 618.3167 671.6832 683.2225 694.4975 695.8678 706.6014 763.0520 778.3814 849.2994 856.5281 861.5778 890.6039 935.2875 967.6139 968.7306 980.0557 984.7513 986.1674 1006.5589 1020.3302 1063.6682 1081.7381 1086.6794 1091.9767 1113.8061 1133.1805 1164.9667 1177.1076 1190.8021 1196.3907 1278.6077 1314.3309 1374.7308 1383.1406 1416.2583 1420.4568 1428.8262 1455.1818 1458.1643 1465.4918 1471.6540 1574.6690 1587.3748 1594.6488 1598.9416 2984.9119 3089.0533 3131.4533 3131.5711 3138.4336 3146.2938 3151.8578 3164.5013 3173.0999 3174.8690 3176.1178 3183.5614
redmass: 5.5744 4.8882 5.6508 7.1552 3.8364 6.1499 6.5851 3.6361 1.1978 6.8111 5.4069 5.5028 6.0142 7.6748 5.6232 5.6553 7.4719 7.0239 12.7056 2.8165 3.9745 4.4685 3.9283 7.7800 8.5924 6.9116 6.6024 8.7903 2.2755 8.6912 2.9860 4.2865 7.5083 1.5859 1.3356 1.5665 1.2628 7.1937 1.3959 1.3604 2.7826 2.0598 5.6888 1.4326 5.6685 1.3273 2.9511 1.8973 1.6193 1.5622 2.7280 1.2485 1.3089 1.1301 1.0553 1.2547 2.6779 1.2946 1.3076 7.9047 8.9793 3.0658 1.1249 2.1190 2.3153 1.0626 2.0330 1.0519 6.8091 6.0457 5.8861 7.3508 1.0299 1.1046 1.0944 1.0963 1.0887 1.0877 1.0921 1.0966 1.0930 1.1007 1.0932 1.0987
irintensity: 0.5323 0.2920 0.2897 1.5919 2.7775 1.0354 0.4999 4.6800 1.6032 4.0321 1.1832 0.3953 3.5077 11.1860 7.1870 1.4492 2.3150 11.7714 4.3632 0.2882 12.1496 22.4606 26.9736 42.8875 41.0754 16.3145 5.0338 123.2443 18.9085 41.2607 78.5097 88.2903 35.4843 29.3373 56.9645 24.5337 2.3695 225.5729 0.8754 0.5811 91.1268 75.0484 9.3236 0.4287 1.9864 0.0110 1.6191 17.7052 4.6832 15.7542 39.3467 0.0688 0.3166 15.3377 0.0540 47.8848 135.3475 5.6197 5.0001 9.7734 1.4113 29.0182 4.2005 20.9338 114.8474 24.6848 7.4535 17.8069 84.8278 0.4027 0.4149 102.7478 48.6569 22.3203 8.3458 7.9200 1.2742 10.1067 10.0008 15.6769 3.3349 18.8654 2.1324 5.5417
temp: 298.150 k
press: 1.00000 atm
elementType: 17 16 15 8 8 6 6 6 6 6 6 6 6 6 6 6 6 6 1 1 1 1 1 1 1 1 1 1 1 1
symmnumber: 1
zpe: 568062.4 jmol-1
zpe.correction: 0.216364 hartree
zpe.thermalcorrener: 0.233800 hartree
zpe.thermalcorrenthalpy: 0.234745 hartree
zpe.thermalcorrgfe: 0.167556 hartree
zpe.sumelectzpe: -1851.079543 hartree
zpe.sumelectthermal: -1851.062106 hartree
zpe.sumelectthermalent: -1851.061162 hartree
zpe.sumelectthermalfe: -1851.128351 hartree
dipole: 1.7947 -0.2253 -2.8200
dipole: 3.3502
quadrupole: -120.0537 -110.5416 -128.7373
quadrupole: 11.4721 1.0879 4.5009
quadrupole: -0.2761 9.2360 -8.9598 11.4721 1.0879 4.5009
hfenergy: -1851.2959066 hartree
pointgroup: C01 [X(C13H12Cl1O2P1S1)]
dipole: 0.5234852 -0.0796421 1.2070422 debye
polarizability: 199.2398834|-16.3374342|209.8299427|13.9777287|16.2176122|177.5107296 unknown
InChI: InChI=1S/C13H12ClO2PS/c1-15-17(18,13-8-3-2-4-9-13)16-12-7-5-6-11(14)10-12/h2-10H,1H3
charge 0 multiplicity 1
30 atoms
Cl -3.561637 -1.877919 -1.807521
S  1.118449 1.295074 -2.338206
P  1.393119 0.814461 -0.352628
O  -0.023139 1.091219 0.708804
O  2.482312 1.774862 0.58712
C  1.983298 -0.877409 0.074736
C  2.204306 -1.213778 1.432106
C  2.19689 -1.816712 -0.95901
C  -1.356699 0.829014 0.336774
C  2.645558 -2.515834 1.751296
C  2.636355 -3.11758 -0.627092
C  2.85976 -3.466765 0.724954
C  -1.717469 -0.265136 -0.486831
C  -2.340249 1.688572 0.878509
C  -3.084517 -0.470571 -0.74594
C  -3.701228 1.441071 0.602403
C  -4.09344 0.357778 -0.219592
C  2.366562 3.2475 0.486878
H  2.035964 -0.471125 2.217785
H  2.02646 -1.526773 -2.002545
H  2.820466 -2.78806 2.797456
H  2.804177 -3.852869 -1.420854
H  3.199385 -4.476844 0.979181
H  -0.964045 -0.935602 -0.90774
H  -2.025635 2.526965 1.506222
H  -4.467566 2.100738 1.022466
H  -5.146119 0.167806 -0.444309
H  1.4357 3.591104 0.970299
H  2.389441 3.567661 -0.571048
H  3.24614 3.633253 1.022825
