program: Gaussian 09
title: 000155626
version: EM64L-G09RevD.01
frameworkgroup: C1[X(C10H16O)]
method: RPBEPBE
basis: SDD
operation: Freq
keyword: #pfreq=noraman
keyword: PBEPBE/SDD
title: #p freq=noraman PBEPBE/SDD
converged: YES YES NO NO
title: Mulliken charges:
elementType: O C C C C C C C C C C H H H H H H H H H H H H H H H H
charge: -0.453111 0.241376 -0.485794 -0.464903 -0.162456 -0.201533 -0.252772 -0.755553 0.489063 -0.837745 -0.722681 0.195815 0.209568 0.243834 0.203217 0.194240 0.214883 0.227186 0.234399 0.226889 0.205124 0.324534 0.225879 0.223572 0.228513 0.213028 0.235429
chargesum: 0.00000
title: Mulliken charges with hydrogens summed into heavy atoms:
elementType: O C C C C C C C C C C
charge: -0.128578 0.241376 -0.080411 -0.017852 0.031784 0.013349 -0.025586 -0.089141 0.489063 -0.159781 -0.274223
polarizability: 1.35182492e+02 3.05012340e+00 1.02953651e+02 -1.04589267e-01 4.67354265e+00 8.62935959e+01
1716.lowfreq: -8.5085 0.0002 0.0003 0.0007 8.9177 18.7445 52.4095 56.4827 146.9428
frequency: 52.1814 56.4221 146.9251 177.9303 187.8355 219.8773 243.8643 270.8258 274.9966 302.2282 334.8024 370.9229 421.3120 435.9790 469.4720 502.3198 547.6800 579.5942 664.7115 709.8448 716.7461 740.9017 821.6509 869.9868 895.8354 913.0872 936.1785 946.0788 970.1757 986.1483 998.4399 1007.3602 1029.2955 1048.0441 1062.8653 1084.7169 1102.5788 1158.5328 1196.1896 1203.2000 1219.8344 1244.8454 1284.1460 1311.5116 1328.8587 1335.3732 1344.5809 1376.2121 1391.2597 1395.3133 1421.1803 1454.5880 1462.5266 1465.1105 1466.3617 1469.9916 1474.6268 1662.8960 1672.0401 2904.9545 2961.5269 2966.0042 2970.1313 2996.0531 3024.7432 3033.2272 3060.6018 3061.7657 3084.2676 3085.5599 3090.9641 3093.7680 3125.7033 3194.1086 3519.0814
redmass: 3.5887 3.0149 3.0739 1.1901 2.3947 2.0089 1.1927 1.7201 1.6053 2.4671 2.4401 2.7608 2.4671 2.2938 2.6936 3.2345 3.0085 3.1379 3.4865 1.2221 2.7071 1.5688 2.2406 2.2610 2.4881 1.8078 1.3255 2.0254 1.4702 1.5179 1.6042 1.6719 1.5535 1.5276 1.8892 1.5954 2.3222 1.6486 1.3166 1.6345 1.5498 1.4510 1.4241 1.7774 1.4220 1.7885 1.6216 1.2763 1.2224 1.6096 1.1840 1.0965 1.0506 1.0727 1.0555 1.0869 1.0623 5.8672 6.5142 1.0804 1.0376 1.0480 1.0485 1.0619 1.0999 1.0963 1.1019 1.0980 1.0979 1.0997 1.0643 1.0820 1.0984 1.1141 1.0656
irintensity: 0.4783 0.1006 0.7390 0.4556 1.7210 2.1227 6.9206 46.2445 85.3239 0.5686 4.4562 6.7790 11.0256 3.8448 0.2663 6.2296 4.0176 3.2929 1.7340 0.6956 4.6920 13.4730 6.6033 45.8759 4.6525 9.5119 60.6637 8.3718 13.4361 2.2724 0.8417 8.3227 8.1973 9.9258 29.4405 29.7387 23.5595 23.9448 20.3335 0.7533 16.4960 1.5283 12.4497 8.3996 3.9011 11.7047 4.9456 24.3908 21.6912 2.8322 1.7789 2.4165 10.1614 11.1981 9.8418 6.3288 23.8520 16.6827 13.8362 30.4845 32.4279 4.9162 69.5780 32.1455 34.4949 31.3472 29.2005 33.9561 31.5546 27.1446 4.4312 9.2934 34.9208 25.8833 5.1077
temp: 298.150 k
press: 1.00000 atm
elementType: 8 6 6 6 6 6 6 6 6 6 6 1 1 1 1 1 1 1 1 1 1 1 1 1 1 1 1
symmnumber: 1
zpe: 613752.8 jmol-1
zpe.correction: 0.233766 hartree
zpe.thermalcorrener: 0.245815 hartree
zpe.thermalcorrenthalpy: 0.246759 hartree
zpe.thermalcorrgfe: 0.196412 hartree
zpe.sumelectzpe: -464.978099 hartree
zpe.sumelectthermal: -464.966051 hartree
zpe.sumelectthermalent: -464.965106 hartree
zpe.sumelectthermalfe: -465.015454 hartree
dipole: -0.7058 -2.0805 -1.1584
dipole: 2.4836
quadrupole: -61.3648 -67.1809 -69.9917
quadrupole: 1.9425 -0.4689 -2.5739
quadrupole: 4.8143 -1.0018 -3.8126 1.9425 -0.4689 -2.5739
hfenergy: -465.2118656 hartree
pointgroup: C01 [X(C10H16O1)]
dipole: -0.2545776 -0.4866079 -0.8082038 debye
polarizability: 135.0446656|2.8645783|94.8675085|2.264469|9.6310504|94.5175649 unknown
InChI: InChI=1S/C10H16O/c1-8(2)9-4-6-10(3,11)7-5-9/h4,6,9,11H,1,5,7H2,2-3H3
charge 0 multiplicity 1
27 atoms
O  -2.291338 -0.396672 1.425904
C  -1.997954 -0.068907 -0.006807
C  -1.175468 -1.216412 -0.647104
C  0.266875 -1.238045 -0.103637
C  1.016257 0.071557 -0.495511
C  -1.18986 1.216378 0.046813
C  0.146406 1.279158 -0.180843
C  -3.332199 0.154099 -0.753516
C  2.407419 0.124524 0.151195
C  3.493677 -0.653508 -0.57122
C  2.647613 0.787412 1.313737
H  -1.159205 -1.081493 -1.748036
H  -1.682907 -2.180964 -0.445499
H  0.234233 -1.309034 0.999603
H  0.813424 -2.121342 -0.484428
H  1.171661 0.045911 -1.600266
H  -1.753308 2.1272 0.290028
H  0.654318 2.253586 -0.153773
H  -3.93938 0.91473 -0.230729
H  -3.157705 0.499187 -1.788448
H  -3.918128 -0.785231 -0.804753
H  -2.969329 -1.123108 1.437563
H  3.200548 -1.712264 -0.71458
H  3.675205 -0.235147 -1.581383
H  4.447178 -0.636647 -0.016365
H  3.64126 0.787074 1.777312
H  1.856907 1.338162 1.835642
