program: Gaussian 09
title: 000155605
version: EM64L-G09RevD.01
frameworkgroup: C1[X(C2H3N3O2)]
method: RPBEPBE
basis: SDD
operation: Freq
keyword: #pfreq=noraman
keyword: PBEPBE/SDD
title: #p freq=noraman PBEPBE/SDD
converged: NO NO NO NO
title: Mulliken charges:
elementType: O O N N N C C H H H
charge: -0.421311 -0.190466 -0.051517 0.016833 -0.055043 -0.441753 0.211602 0.271165 0.270910 0.389580
chargesum: 0.00000
title: Mulliken charges with hydrogens summed into heavy atoms:
elementType: O O N N N C C
charge: -0.031731 -0.190466 -0.051517 0.016833 -0.055043 0.100322 0.211602
polarizability: 8.34777771e+01 3.34643060e+00 4.14117897e+01 4.89947637e-02 -1.14493877e-02 2.47228204e+01
1716.lowfreq: -32.9442 -13.9288 -12.5733 -0.0010 -0.0007 -0.0004 12.9020 54.1898 129.1292
frequency: 6.3469 53.8084 129.1286 261.7220 394.2642 477.3969 495.7407 563.8604 589.0654 626.5055 861.6379 913.6881 958.6396 1046.6147 1191.0699 1251.1317 1290.0187 1363.4135 1435.0203 1709.6735 2052.4584 2975.0129 3028.9891 3529.5501
redmass: 9.7007 2.7853 9.1285 11.2525 7.3593 11.9763 1.9135 9.2052 5.2572 1.3824 4.9275 7.2572 1.9943 2.4146 1.0849 1.5805 10.2144 1.7883 1.0737 9.3682 13.3158 1.0568 1.1026 1.0644
irintensity: 2.3124 5.0550 1.8919 0.5840 10.2120 4.8482 23.6053 1.4920 59.5164 155.6793 2.7924 48.9814 0.7257 327.3733 0.5594 15.1102 72.8541 0.4874 41.2577 230.5935 330.6509 30.3422 10.8850 38.9455
temp: 298.150 k
press: 1.00000 atm
elementType: 8 8 7 7 7 6 6 1 1 1
symmnumber: 1
zpe: 162720.6 jmol-1
zpe.correction: 0.061977 hartree
zpe.thermalcorrener: 0.069241 hartree
zpe.thermalcorrenthalpy: 0.070186 hartree
zpe.thermalcorrgfe: 0.027440 hartree
zpe.sumelectzpe: -392.115415 hartree
zpe.sumelectthermal: -392.108150 hartree
zpe.sumelectthermalent: -392.107206 hartree
zpe.sumelectthermalfe: -392.149951 hartree
dipole: 2.3756 -2.8182 0.0155
dipole: 3.6859
quadrupole: -40.9729 -44.5975 -38.1735
quadrupole: -1.5515 -0.0492 -0.0153
quadrupole: 0.2750 -3.3496 3.0745 -1.5515 -0.0492 -0.0153
hfenergy: -392.1773916 hartree
pointgroup: C01 [X(C2H3N3O2)]
dipole: 0.9123744 1.1271154 -0.0101131 debye
dipolederiv: -0.9789556 -0.536185 -0.0006499 -0.5032353 -0.7132798 -0.0016942 -0.0036333 -0.0040591 -0.4392476 -0.653637 0.199935 -0.0022311 -0.0962607 -0.9479649 0.0005282 -0.001902 0.0053503 -0.2898194 -1.2911059 0.026777 0.0028743 0.3682095 -0.042039 -0.0029128 -0.0014923 -0.002262 -0.2482696 1.6768874 -0.3129462 -0.0007512 -0.4721361 -0.0195423 0.0021158 -0.0004581 0.001816 0.0900948 -0.895001 0.117277 -0.0002571 0.0898826 -0.0910318 -0.000127 0.0024481 -0.000529 -0.0946208 0.4540297 0.3018957 -0.0060215 0.4277918 0.065234 0.0033607 -0.0063181 0.0027096 0.3842677 1.5255935 0.1466159 0.0072197 0.2938171 1.473152 -0.0018878 0.0092033 -0.0034196 0.208656 -0.0393004 -0.0263677 0.00853 -0.1274757 0.0265074 -0.0759562 -0.0233728 -0.1021696 -0.0071831 -0.0389525 -0.0265404 -0.0071957 -0.1271301 0.0306531 0.0751429 0.0274043 0.1013426 -0.0123673 0.2404419 0.1095386 -0.0015176 0.146537 0.2183111 0.0014304 -0.0018791 0.0012207 0.4084892 unknown
polarizability: 83.5943724|-2.5062726|41.2947757|0.024244|-0.0882299|24.723239 unknown
InChI: InChI=1S/C2H3N3O2/c3-5-4-1-2(6)7/h6H,1H2
charge 0 multiplicity 1
10 atoms
O  2.533514 0.944618 0.004225
O  1.798057 -1.266237 0.007702
N  -0.873523 -0.416908 -0.000841
N  -2.080649 -0.034018 -0.001991
N  -3.259513 0.106696 0.001376
C  0.182599 0.629628 -0.011509
C  1.544617 -0.052694 -0.001849
H  0.124854 1.296377 0.871798
H  0.12779 1.273481 -0.911968
H  3.434256 0.522157 0.012257
