program: Gaussian 09
title: 000014192
version: EM64L-G09RevD.01
frameworkgroup: C1[X(C21H30NO3)]
method: RPBEPBE
basis: SDD
operation: Freq
keyword: #p
keyword: freq=noraman
keyword: PBEPBE/SDD
title: #p freq=noraman PBEPBE/SDD
converged: YES YES NO NO
title: Mulliken charges:
elementType: O O O N C C C C C C C C C C C C C C C C C C C C C H H H H H H H H H H H H H H H H H H H H H H H H H H H H H H
charge: -0.483277 -0.342129 -0.254428 -0.128467 0.035028 -0.539352 -0.005200 -0.768015 -0.570870 -0.582128 -0.562402 0.287925 0.422955 0.179848 -0.555631 -0.390712 -0.408502 0.322831 -0.338825 -0.235087 -0.243794 -0.364604 -0.236042 -0.532841 -0.531213 0.290905 0.243907 0.248771 0.213295 0.320690 0.235645 0.271659 0.255476 0.277819 0.307362 0.250773 0.266201 0.255106 0.275640 0.265957 0.377198 0.305577 0.268472 0.226195 0.250839 0.243196 0.238937 0.267895 0.247753 0.247207 0.218785 0.249247 0.215826 0.261975 0.226624
chargesum: 1.00000
title: Mulliken charges with hydrogens summed into heavy atoms:
elementType: O O O N C C C C C C C C C C C C C C C C C C C C C
charge: -0.106078 -0.342129 -0.254428 -0.128467 0.325933 -0.046674 -0.005200 0.001616 0.234084 0.242208 0.234301 0.287925 0.422955 0.179848 -0.250055 -0.122240 -0.182308 0.322831 -0.087987 0.008109 -0.004857 -0.096710 0.011711 0.182398 0.173212
polarizability: 2.47114238e+02 2.00643513e+01 2.61278599e+02 -8.00233922e+00 -9.83460459e+00 2.08451982e+02
1716.lowfreq: -12.3123 -6.5052 -5.9378 -0.0003 0.0005 0.0007 17.8480 30.4918 36.6466
frequency: 15.5273 30.2312 36.5219 46.0244 57.7800 64.0842 73.6283 96.8710 103.9881 136.1673 140.1969 165.4305 179.1859 191.9485 198.4926 209.5654 219.9759 232.5955 235.1379 254.5006 261.9663 266.9285 270.0987 283.1991 287.3224 294.6206 313.6951 344.7239 360.8721 374.8638 387.6378 397.3081 401.4653 415.1536 424.9673 456.6770 463.6524 470.7251 482.6284 507.7353 539.6212 568.7569 596.5088 613.6030 618.2103 639.2484 669.6267 686.3843 705.2178 719.3830 740.3401 777.6005 800.8342 817.2010 821.0740 851.6877 860.8970 889.8708 907.9096 926.6324 930.7631 938.6663 946.0905 948.2143 969.1896 972.7224 984.2998 990.3957 996.0447 1007.9000 1027.5161 1030.4476 1047.1268 1050.7453 1069.6487 1090.4432 1098.8044 1108.3081 1109.8798 1111.0180 1134.4354 1147.7175 1150.7868 1155.5204 1167.4749 1179.9233 1181.1464 1192.3000 1199.7063 1215.0100 1227.6951 1237.6394 1243.1597 1264.6601 1267.3875 1277.3406 1313.2090 1324.5897 1343.9119 1364.9498 1372.0678 1378.7607 1396.7251 1404.8288 1422.6521 1429.3020 1435.1558 1436.5692 1439.4021 1450.4158 1452.8721 1463.9003 1465.4873 1465.9907 1467.7074 1468.4873 1471.6722 1473.8333 1477.0464 1483.8294 1486.0346 1487.3423 1496.1139 1500.3239 1510.0228 1583.8125 1589.5668 1608.5567 1612.0913 2964.2282 2974.2989 2993.8779 3012.6622 3016.3315 3024.7859 3027.6990 3032.9517 3054.1713 3072.3700 3090.3882 3092.0628 3105.5185 3126.3646 3130.1916 3131.9556 3135.2561 3136.3778 3136.4754 3137.5982 3141.9751 3147.3403 3154.7196 3156.4485 3157.7069 3161.1983 3167.1009 3172.5569 3178.1390 3559.9273
redmass: 3.3272 4.3202 3.6433 3.2822 3.4753 3.6986 3.5962 3.3666 3.8043 3.8616 3.2723 3.5615 2.9756 1.2421 1.3956 1.5759 2.0246 1.9597 1.6871 2.8724 1.2495 1.2684 1.6758 2.8810 2.2767 2.0513 4.3449 1.7591 3.6692 3.0748 4.5239 2.5330 2.8166 2.2817 4.8452 2.7941 4.3502 3.4317 2.3836 2.8424 3.6829 3.3419 3.9996 5.2308 5.4643 4.4294 6.1172 3.8428 1.6773 4.2712 4.4841 2.1528 3.3664 3.3943 1.5532 1.2596 3.2466 2.8872 1.5354 1.6846 1.9510 2.6305 1.4873 2.3875 4.5342 2.8749 1.3894 5.6521 3.7783 1.3278 2.1840 2.1123 1.9221 1.2458 2.2139 1.5088 1.5540 1.3906 1.3221 1.2589 1.4986 1.5405 1.7919 1.4049 1.8735 1.0967 2.1812 2.1506 1.1775 1.7134 1.8781 2.3608 1.8343 1.3691 1.4573 2.0408 1.5387 1.3683 1.5173 1.2577 7.2821 6.7510 1.1964 2.9960 1.1396 1.1424 1.2641 1.9941 1.3185 1.0725 1.0804 1.0931 1.0717 1.0801 1.1040 1.1065 1.0486 1.1055 1.1517 1.7852 1.7588 1.0545 1.0869 1.0508 1.0518 8.1929 5.9126 6.0383 6.5790 1.0333 1.0327 1.0382 1.0784 1.0366 1.0612 1.0329 1.0338 1.1040 1.1033 1.0992 1.1005 1.1004 1.0878 1.1020 1.1053 1.0862 1.0995 1.1052 1.1042 1.1040 1.0912 1.0882 1.0957 1.1042 1.1043 1.0895 1.1015 1.0966 1.0665
irintensity: 1.2645 0.8349 0.2461 1.6624 3.7455 2.7795 1.0577 0.3583 1.1751 2.4979 8.3547 6.9775 6.4349 0.7761 3.8810 8.7325 3.2833 46.6133 8.5481 18.8071 0.5638 3.2693 0.5392 19.4508 17.5768 2.3817 1.3364 4.4375 2.2456 0.0840 1.8673 0.2525 0.6771 1.7063 1.8634 0.9375 3.4250 1.4375 7.3907 0.8717 3.9881 20.1030 3.9775 6.3609 3.8127 4.8239 18.0595 10.1698 51.1994 15.0888 4.4121 63.3373 30.5222 10.2542 46.6133 0.9674 8.9038 7.8692 26.9258 0.9083 8.7315 7.1859 1.5388 10.8002 48.8680 21.8641 0.3795 7.3749 109.7141 0.4548 3.6295 8.2187 24.2916 4.9600 11.7040 7.4004 10.0176 6.4937 3.8193 0.0670 2.6302 2.5616 26.5622 1.4092 15.6346 8.0936 88.2902 136.1815 14.7916 1.3479 3.7541 0.4363 3.1607 14.3999 33.7931 96.4867 63.0752 3.6993 25.5259 7.9242 20.2743 4.1051 40.9321 50.0869 15.1952 29.2423 6.4699 15.2598 2.5823 6.5572 12.5853 70.1309 22.8937 62.5025 59.3286 4.4555 16.9314 24.0846 2.8834 25.4879 103.2229 30.5241 25.0298 56.9272 31.2862 0.4747 1.1122 6.5274 25.5841 52.4464 51.2183 29.6903 1.5787 12.3582 14.9374 5.2229 11.6349 43.0349 29.1331 5.1198 11.7025 12.8858 3.0418 12.8507 0.8083 2.9470 18.0138 1.7904 10.4329 11.8414 6.0442 5.2175 27.8289 1.2567 6.1150 4.1363 13.7847 2.4979 21.1121
temp: 298.150 k
press: 1.00000 atm
elementType: 8 8 8 7 6 6 6 6 6 6 6 6 6 6 6 6 6 6 6 6 6 6 6 6 6 1 1 1 1 1 1 1 1 1 1 1 1 1 1 1 1 1 1 1 1 1 1 1 1 1 1 1 1 1 1
symmnumber: 1
zpe: 1232421.2 jmol-1
zpe.correction: 0.469404 hartree
zpe.thermalcorrener: 0.496043 hartree
zpe.thermalcorrenthalpy: 0.496987 hartree
zpe.thermalcorrgfe: 0.412852 hartree
zpe.sumelectzpe: -1096.480069 hartree
zpe.sumelectthermal: -1096.453430 hartree
zpe.sumelectthermalent: -1096.452486 hartree
zpe.sumelectthermalfe: -1096.536621 hartree
dipole: 7.4251 -6.0368 1.3095
dipole: 9.6587
quadrupole: -92.2498 -116.6406 -125.5652
quadrupole: -18.2798 -0.1787 -9.2885
quadrupole: 19.2354 -5.1554 -14.0800 -18.2798 -0.1787 -9.2885
hfenergy: -1096.9494731 hartree
pointgroup: C01 [X(C21H30N1O3)]
dipole: -3.1934953 1.9916487 0.5244973 debye
polarizability: 242.4457561|17.9237036|266.6727248|5.5845048|8.9844831|207.7263382 unknown
InChI: InChI=1S/C21H30NO3/c1-16(22(2,3)4)15-21(23,17-10-8-7-9-11-17)19-14-18(24-5)12-13-20(19)25-6/h7-14,16,23H,15H2,1-6H3
charge 1 multiplicity 1
55 atoms
O  0.103469 0.153305 -2.277181
O  0.430919 0.618072 2.012303
O  -0.620287 -4.426181 -0.274206
N  -3.276464 1.529963 0.266105
C  -2.237941 1.029998 -0.833992
C  -0.816686 1.582469 -0.560244
C  0.291871 0.523832 -0.842228
C  -2.713425 1.34818 -2.259739
C  -4.684559 1.069067 -0.102862
C  -2.926039 0.906833 1.618187
C  -3.274546 3.048558 0.391189
C  0.086551 -0.733804 0.038338
C  1.720616 1.08521 -0.681006
C  0.216233 -0.66663 1.452263
C  -0.208695 -1.982478 -0.56002
C  2.800108 0.160232 -0.672128
C  2.015867 2.470648 -0.642346
C  -0.340459 -3.152593 0.229056
C  0.090805 -1.83625 2.240948
C  4.137559 0.608069 -0.630032
C  3.354299 2.920134 -0.591886
C  -0.18272 -3.075187 1.634601
C  4.420434 1.992668 -0.589611
C  1.097347 0.685867 3.325211
C  -0.71048 -4.587534 -1.729851
H  -2.240746 -0.06593 -0.680914
H  -0.644675 2.453467 -1.215196
H  -0.670273 1.89729 0.486017
H  -2.846382 2.43061 -2.43916
H  -1.902663 1.005079 -2.924641
H  -3.633577 0.81475 -2.548616
H  -4.662824 -0.009235 -0.322052
H  -5.352649 1.262054 0.751109
H  -5.040293 1.623127 -0.981723
H  -1.885075 1.136991 1.887452
H  -3.613971 1.308844 2.378964
H  -3.044015 -0.185198 1.544543
H  -4.059258 3.346593 1.104349
H  -2.295687 3.385418 0.758603
H  -3.479297 3.494995 -0.592303
H  0.996529 0.014665 -2.683964
H  -0.307338 -2.008902 -1.648419
H  2.591747 -0.916296 -0.678942
H  1.214944 3.216462 -0.643698
H  0.213986 -1.791565 3.327259
H  4.955654 -0.119994 -0.624166
H  3.565393 3.994435 -0.558739
H  -0.27147 -3.990063 2.22735
H  5.456901 2.344135 -0.555062
H  2.010812 0.064694 3.331077
H  0.420258 0.366636 4.140271
H  1.364744 1.744247 3.459804
H  -1.542349 -3.990236 -2.151454
H  -0.907028 -5.657373 -1.886822
H  0.239526 -4.306045 -2.223194
