program: Gaussian 09
title: 000155535
version: EM64L-G09RevD.01
frameworkgroup: C1[X(C13H4Cl3F3N4O6)]
method: RPBEPBE
basis: SDD
operation: Freq
keyword: #p
keyword: freq=noraman
keyword: PBEPBE/SDD
title: #p freq=noraman PBEPBE/SDD
converged: YES YES NO NO
title: Mulliken charges:
elementType: Cl Cl Cl F F F O O O O O O N N N N C C C C C C C C C C C C C H H H H
charge: 0.127330 0.018078 0.011668 -0.152192 -0.143048 -0.145170 -0.209415 -0.125937 -0.172094 -0.180265 -0.189041 -0.188828 -0.458184 0.001817 0.002689 0.021504 0.235429 0.439839 0.388997 0.452557 -0.571240 -0.593890 0.771713 0.272756 -0.345965 -0.246225 -0.404626 -0.400757 0.448961 0.370137 0.326998 0.318370 0.318035
chargesum: 0.00000
title: Mulliken charges with hydrogens summed into heavy atoms:
elementType: Cl Cl Cl F F F O O O O O O N N N N C C C C C C C C C C C C C
charge: 0.127330 0.018078 0.011668 -0.152192 -0.143048 -0.145170 -0.209415 -0.125937 -0.172094 -0.180265 -0.189041 -0.188828 -0.088048 0.001817 0.002689 0.021504 0.235429 0.439839 0.388997 0.452557 -0.571240 -0.266892 0.771713 0.272756 -0.345965 -0.246225 -0.086256 -0.082722 0.448961
polarizability: 4.21077080e+02 -1.87289924e+01 2.33724022e+02 -2.03727679e+01 -1.10283144e+01 1.60135475e+02
1716.lowfreq: -5.6264 -1.4238 -0.0018 -0.0010 -0.0008 3.3842 22.2704 23.2745 26.8527
frequency: 22.2320 23.2671 26.8185 43.6530 56.3480 58.5698 65.2422 67.8137 88.6960 98.5799 117.3302 133.3528 133.6325 145.2706 159.4760 185.2309 200.7382 211.4417 214.9545 224.4177 246.6082 273.2781 287.8153 292.3814 306.1916 326.5431 339.3917 349.0617 353.7296 381.5973 392.1985 431.0945 451.1394 455.5830 481.2435 504.5170 512.1051 519.0288 528.3888 563.4878 579.3779 609.6939 628.5907 648.7293 671.2398 680.4169 694.2151 701.9004 705.6737 706.7042 718.7506 738.7054 755.3690 767.0858 799.5820 811.4539 855.5817 893.7732 914.1783 923.9984 934.6083 960.2692 1009.8328 1031.4644 1051.0863 1074.4681 1116.5329 1137.0445 1175.4357 1179.3031 1192.5510 1204.5995 1243.6289 1252.7261 1310.3755 1333.4489 1357.9368 1361.5741 1373.0522 1384.5697 1397.1576 1407.2127 1448.2204 1464.1348 1529.6768 1560.5462 1580.8792 1587.4260 1610.0932 3183.6003 3189.9582 3192.7145 3269.6715
redmass: 15.6198 15.9195 19.0575 17.7715 17.1041 16.6060 18.5832 16.4443 17.2391 18.9010 12.1296 13.5456 19.4361 12.2121 16.7258 15.9155 19.0884 5.8373 10.0583 18.2571 10.1257 11.4460 17.5446 11.7236 15.3681 10.6946 17.1409 12.2759 11.9043 11.3803 10.8457 7.9842 9.2599 12.4580 8.2465 9.7180 5.5627 8.1285 5.7020 6.2241 9.3971 10.9126 5.4282 10.1666 3.8465 6.3440 10.2150 4.4253 13.4793 6.1305 3.4195 8.6848 7.4206 6.9354 6.9687 10.6495 11.2271 8.1380 1.3553 1.4931 7.6561 1.5364 7.9068 12.2947 2.3987 11.2874 3.7682 3.3208 8.5099 1.5675 8.0636 11.3896 2.8176 4.4196 2.7612 5.5586 5.5681 8.1953 10.0036 11.1500 9.5945 6.7829 4.9497 4.2230 3.8766 4.4380 3.5240 7.5582 8.5946 1.0917 1.0931 1.0937 1.0758
irintensity: 0.1671 0.1439 0.1247 0.1495 0.3329 0.2889 1.9719 1.7840 0.1064 0.9228 1.2160 0.7982 0.2797 3.0174 2.7734 2.0071 2.8826 0.5299 0.0407 1.3613 1.8962 2.2990 1.9795 0.9160 0.3236 5.9099 0.5768 3.9914 8.5288 1.6455 2.0509 7.2153 10.3744 13.4009 0.4377 5.5606 4.4301 4.2572 10.2018 2.8070 51.4655 23.7556 11.1100 2.9085 17.7522 14.2038 14.9857 5.5788 25.3929 19.5683 94.3989 5.8976 75.3151 23.8602 40.1703 2.8282 34.0071 11.6931 1.5272 34.8645 26.8584 68.5292 175.3295 120.3706 7.5321 222.5151 24.7687 74.4976 339.3480 14.5830 73.7776 637.3202 152.2289 24.9447 93.6301 174.7313 20.7882 57.6838 64.3669 57.9879 32.5046 162.1474 18.5629 223.7806 264.0643 71.0110 56.8866 187.4395 254.8815 20.4728 14.0959 16.1158 148.1019
temp: 298.150 k
press: 1.00000 atm
elementType: 17 17 17 9 9 9 8 8 8 8 8 8 7 7 7 7 6 6 6 6 6 6 6 6 6 6 6 6 6 1 1 1 1
symmnumber: 1
zpe: 449695.8 jmol-1
zpe.correction: 0.171280 hartree
zpe.thermalcorrener: 0.197375 hartree
zpe.thermalcorrenthalpy: 0.198320 hartree
zpe.thermalcorrgfe: 0.112004 hartree
zpe.sumelectzpe: -2845.497161 hartree
zpe.sumelectthermal: -2845.471066 hartree
zpe.sumelectthermalent: -2845.470122 hartree
zpe.sumelectthermalfe: -2845.556437 hartree
dipole: -1.6836 1.7022 -0.1194
dipole: 2.3971
quadrupole: -223.1718 -198.2475 -187.6940
quadrupole: 8.2757 1.8602 -5.9469
quadrupole: -20.1340 4.7903 15.3437 8.2757 1.8602 -5.9469
hfenergy: -2845.6684411 hartree
pointgroup: C01 [X(C13H4Cl3F3N4O6)]
dipole: 0.5908195 -0.566012 -0.4690561 debye
polarizability: 413.035725|-49.4471983|203.388346|1.7382404|39.2584689|198.5125054 unknown
InChI: InChI=1S/C13H4Cl3F3N4O6/c14-6-1-4(21(24)25)2-7(15)10(6)20-11-8(22(26)27)3-5(13(17,18)19)9(16)12(11)23(28)29/h1-3,20H
charge 0 multiplicity 1
33 atoms
Cl 4.432201 -2.190664 -0.783439
Cl -2.644712 -0.513182 -2.988516
Cl -0.796415 -0.274177 2.28461
F  4.965935 1.946644 0.983964
F  5.507805 -0.217833 1.355085
F  5.734525 0.672421 -0.720545
O  0.507936 -2.808952 -2.030556
O  1.940459 -3.683171 -0.490504
O  0.543182 3.087647 0.79223
O  -0.831339 2.105676 -0.73989
O  -6.691624 0.947249 0.142217
O  -5.900556 1.118988 2.278813
N  -0.585184 -0.728541 -0.833703
N  1.405618 -2.688756 -1.09017
N  0.214207 2.108608 0.020808
N  -5.751683 0.872161 1.021849
C  0.711351 -0.345439 -0.524518
C  1.775812 -1.315649 -0.685222
C  1.123036 0.940662 -0.041723
C  3.475727 0.264376 0.101512
C  3.13098 -1.008833 -0.419951
C  2.45813 1.211312 0.294221
C  -1.818617 -0.26725 -0.337006
C  4.901211 0.653017 0.422771
C  -2.925754 -0.169656 -1.2331
C  -2.094136 -0.026024 1.041122
C  -4.208507 0.19708 -0.816179
C  -3.36122 0.359209 1.496487
C  -4.401543 0.469873 0.553706
H  -0.631139 -1.447407 -1.580204
H  2.69627 2.206544 0.678423
H  -5.041949 0.288179 -1.516284
H  -3.558812 0.552788 2.553391
