program: Gaussian 09
title: 000155521
version: EM64L-G09RevD.01
frameworkgroup: C1[X(C12H18N2O)]
method: RPBEPBE
basis: SDD
operation: Freq
keyword: #p
keyword: freq=noraman
keyword: PBEPBE/SDD
title: #p freq=noraman PBEPBE/SDD
converged: YES YES NO NO
title: Mulliken charges:
elementType: O N N C C C C C C C C C C C C H H H H H H H H H H H H H H H H H H
charge: -0.239118 -0.209625 -0.049352 -0.221919 -0.227587 -0.438057 -0.428278 -0.387545 -0.396404 0.152450 0.148619 -0.372528 -0.480084 -0.390501 -0.413404 0.244131 0.239299 0.211822 0.224229 0.191861 0.215235 0.202334 0.193890 0.199619 0.216171 0.223831 0.262476 0.249314 0.220208 0.213626 0.208374 0.209030 0.227886
chargesum: 0.00000
title: Mulliken charges with hydrogens summed into heavy atoms:
elementType: O N N C C C C C C C C C C C C
charge: -0.239118 -0.209625 -0.049352 0.022212 0.011712 -0.002006 -0.021182 0.008679 0.019386 0.152450 0.148619 0.113779 -0.010563 0.031499 0.023511
polarizability: 1.65932510e+02 -2.63776436e+00 1.37138848e+02 -4.28639374e+00 -2.32524186e-01 1.08165608e+02
1716.lowfreq: -35.6779 -11.7414 -7.5341 -0.0003 0.0003 0.0004 57.2995 75.0594 93.3753
frequency: 56.9919 74.7249 93.2970 128.8249 179.1436 210.5080 251.5565 282.2396 291.8408 312.9134 324.8001 346.9896 418.8110 434.2229 454.5197 499.9632 517.7175 552.9091 586.3761 634.5937 691.7351 706.2054 714.4349 789.4084 811.8903 820.6541 846.5391 863.6807 876.2006 895.7739 910.2092 912.5702 962.7375 976.8141 981.1743 1034.0034 1047.0242 1057.8421 1083.3106 1090.8817 1097.3374 1105.1433 1133.2307 1147.2982 1166.4389 1176.6317 1188.2514 1215.5549 1233.1339 1251.8423 1256.1271 1271.6330 1274.0879 1292.0627 1297.2157 1304.7501 1322.8978 1327.6125 1334.0415 1336.2840 1341.1554 1347.9561 1349.9813 1356.0696 1370.1980 1451.4574 1452.0145 1461.5942 1464.7171 1465.4282 1472.8988 1474.1143 1492.2674 1602.6487 1619.1964 2934.5538 2966.1963 2970.9132 2976.0661 2981.0400 2983.2188 2985.6524 2985.7097 2989.4850 3025.6306 3031.3875 3041.6903 3049.5637 3051.7992 3056.1150 3056.7169 3076.9600 3083.2980
redmass: 3.3462 2.7810 3.8021 2.9373 2.8860 3.2820 3.2203 3.0047 2.8135 5.6196 1.8630 2.0796 3.5050 3.1613 2.3213 3.3327 2.9094 3.8402 3.8149 3.4800 3.3402 3.5446 4.3765 2.3818 1.8171 1.6266 2.6005 2.7454 2.3138 2.1104 1.9687 1.4081 2.1015 2.7427 2.3832 2.8832 1.5725 1.9380 1.7571 1.5551 1.6141 1.7454 2.2226 2.2496 1.4287 2.1253 1.5509 1.6525 1.3270 1.3115 1.3929 1.9067 1.4077 1.4255 1.3144 1.8337 1.7197 1.5565 1.3613 1.3847 1.4886 1.4849 1.4910 1.4422 1.5743 1.0834 1.0861 1.0862 1.0865 1.0851 1.0901 1.0901 1.0840 10.5356 10.6440 1.0816 1.0629 1.0694 1.0692 1.0615 1.0654 1.0615 1.0626 1.0610 1.0854 1.0964 1.0998 1.0982 1.1005 1.1020 1.1012 1.0958 1.0932
irintensity: 2.1510 0.2054 2.0846 0.7479 0.1589 2.6235 1.1616 4.1905 2.7832 5.0105 2.6391 1.4265 4.0612 0.7440 3.3284 0.0682 2.7607 4.4813 7.4433 7.3331 1.8945 6.5964 3.8816 0.5989 7.5132 7.1158 2.0158 3.6452 2.8207 12.1231 0.5515 5.3113 8.9195 23.3284 9.9399 2.1486 0.6580 4.3370 7.9814 7.9361 1.8066 0.4453 15.8716 16.9485 14.4566 10.1909 1.8144 64.5925 3.4415 27.2556 16.5503 64.9034 10.3313 13.4895 5.5398 81.4837 31.1608 5.7479 0.5388 2.3632 7.2831 8.7459 3.0347 1.6833 24.5826 9.2082 8.4845 11.9063 16.6139 10.3751 14.9710 9.8124 13.5811 212.9120 196.0818 27.2766 40.9917 10.6508 32.9731 48.9887 29.0859 18.4513 35.3340 35.6908 13.4045 55.6867 55.4549 51.0751 0.6400 73.7499 67.2937 11.7590 16.0260
temp: 298.150 k
press: 1.00000 atm
elementType: 8 7 7 6 6 6 6 6 6 6 6 6 6 6 6 1 1 1 1 1 1 1 1 1 1 1 1 1 1 1 1 1 1
symmnumber: 1
zpe: 750209.9 jmol-1
zpe.correction: 0.285740 hartree
zpe.thermalcorrener: 0.298597 hartree
zpe.thermalcorrenthalpy: 0.299541 hartree
zpe.thermalcorrgfe: 0.246794 hartree
zpe.sumelectzpe: -651.673673 hartree
zpe.sumelectthermal: -651.660816 hartree
zpe.sumelectthermalent: -651.659871 hartree
zpe.sumelectthermalfe: -651.712619 hartree
dipole: -1.2915 -1.9023 0.7000
dipole: 2.4035
quadrupole: -77.8141 -104.5484 -87.8409
quadrupole: 4.0757 -1.2250 -0.1899
quadrupole: 12.2537 -14.4806 2.2269 4.0757 -1.2250 -0.1899
hfenergy: -651.9594125 hartree
pointgroup: C01 [X(C12H18N2O1)]
dipole: 0.5176782 0.7437989 0.2700966 debye
polarizability: 165.8710878|-2.9678584|137.2101187|4.2491866|-0.004956|108.1557599 unknown
InChI: InChI=1S/C12H18N2O/c15-12-9-5-1-2-6-10(9)13-11-7-3-4-8-14(11)12/h9-10H,1-8H2
charge 0 multiplicity 1
33 atoms
O  0.421117 -2.758181 -0.318719
N  1.166287 -0.5471 -0.156806
N  -0.312594 1.332597 -0.551579
C  -1.273914 -0.971713 -0.261648
C  -1.325608 0.359083 -1.059689
C  -1.785871 -0.785421 1.199184
C  -2.729462 1.000304 -1.008932
C  -3.204866 -0.170332 1.20825
C  -3.230513 1.173935 0.442352
C  0.148905 -1.523631 -0.267279
C  0.83729 0.854897 -0.155627
C  2.581989 -1.025081 -0.154386
C  1.880335 1.807147 0.411399
C  3.512144 -0.096327 0.639865
C  3.339212 1.362367 0.170007
H  -1.911023 -1.728932 -0.754932
H  -1.070624 0.147151 -2.122359
H  -1.098758 -0.118177 1.756144
H  -1.779559 -1.766195 1.710023
H  -3.435724 0.359593 -1.575185
H  -2.683231 1.979456 -1.520016
H  -3.541158 -0.025232 2.252918
H  -3.916344 -0.880295 0.737221
H  -4.253316 1.596654 0.441014
H  -2.575628 1.903711 0.958505
H  2.928908 -1.094162 -1.205462
H  2.571149 -2.050473 0.250135
H  1.672021 2.805808 -0.00531
H  1.709178 1.873384 1.506258
H  4.553805 -0.439168 0.496896
H  3.2870 -0.169504 1.721993
H  3.588776 1.439298 -0.907081
H  4.028078 2.036537 0.710944
