program: Gaussian 09
title: 000155519
version: EM64L-G09RevD.01
frameworkgroup: C1[X(C20H30O2)]
method: RPBEPBE
basis: SDD
operation: Freq
keyword: #pfreq=noraman
keyword: PBEPBE/SDD
title: #p freq=noraman PBEPBE/SDD
converged: YES YES NO NO
title: Mulliken charges:
elementType: O O C C C C C C C C C C C C C C C C C C C C H H H H H H H H H H H H H H H H H H H H H H H H H H H H H H
charge: -0.168954 -0.229894 -0.089275 -0.037792 -0.257318 -0.493461 -0.428375 -0.533636 -0.789542 0.415793 -0.486687 0.477173 -0.189387 -0.298746 -0.535790 -0.357711 -0.310665 -0.243342 -0.833127 0.376137 -0.798136 -0.801949 0.199559 0.241382 0.208147 0.243803 0.242259 0.201764 0.230097 0.189772 0.208925 0.211575 0.233804 0.217571 0.197780 0.204881 0.172352 0.268573 0.201872 0.221235 0.225789 0.229006 0.208528 0.230795 0.225807 0.230044 0.259117 0.207760 0.227030 0.233443 0.219322 0.222694
chargesum: 0.00000
title: Mulliken charges with hydrogens summed into heavy atoms:
elementType: O O C C C C C C C C C C C C C C C C C C C C
charge: -0.168954 -0.229894 0.110285 0.203589 -0.049171 -0.007400 0.003487 -0.134939 -0.126594 0.415793 -0.084026 0.477173 -0.017035 -0.030172 -0.112683 -0.131922 -0.081659 -0.034814 -0.146480 0.376137 -0.104230 -0.126491
polarizability: 2.54432133e+02 8.44561452e+00 2.18057651e+02 -4.64739247e+00 1.00098980e+01 1.90802989e+02
1716.lowfreq: -9.4331 -3.2323 -0.0006 0.0001 0.0006 8.3501 19.2721 32.9784 51.5438
frequency: 17.9709 32.8969 51.5241 52.8274 64.4783 68.3592 78.7397 98.3521 127.8444 144.6017 146.8677 167.8833 170.7592 183.6975 186.2700 201.6330 218.0736 229.7738 241.9444 252.5193 271.8660 291.8361 294.1368 306.6249 310.6182 336.1285 357.1034 374.2563 385.0846 394.0160 413.9188 436.5232 448.5364 460.3043 469.6195 498.9902 509.0740 528.9400 579.0649 595.0814 655.5146 694.2866 739.8008 754.4737 782.3148 796.4430 808.6931 836.2450 851.2973 863.8051 882.1557 886.7901 919.1952 942.1702 948.2885 949.9314 961.4868 973.2109 986.9432 992.3607 998.0511 998.9634 1006.7960 1021.6499 1033.7724 1041.9943 1063.6641 1065.7729 1075.1215 1085.1140 1088.9694 1100.0836 1117.3055 1132.5415 1139.4865 1169.3101 1180.7716 1189.4905 1195.1991 1228.3679 1236.6810 1242.8635 1245.7997 1268.9206 1277.9012 1288.0172 1294.1859 1303.8552 1307.5576 1314.0370 1330.5756 1339.9577 1343.2821 1347.8575 1350.8649 1361.0879 1389.0141 1391.1739 1392.1266 1393.1317 1400.5216 1417.3173 1456.3355 1457.1849 1459.5111 1460.9077 1464.8290 1470.9372 1473.0396 1473.4164 1474.7348 1478.6517 1484.8600 1495.5443 1501.8107 1559.5732 1625.8071 1646.0424 1672.8980 1691.3035 2845.8067 2927.0059 2940.7358 2957.7691 2959.0207 2959.5879 2963.8794 2974.2881 2974.8694 2979.2445 2986.8549 2989.0291 2991.1961 3002.4921 3023.3217 3030.2829 3031.5091 3034.9101 3035.0283 3041.0273 3042.2024 3065.3701 3068.9841 3072.9591 3080.2276 3080.5702 3085.9462 3088.1843 3095.1442 3107.5100
redmass: 4.5689 3.2903 4.2539 4.2623 5.3533 3.5462 3.1332 5.8646 3.3949 1.0799 5.6256 2.0673 1.8257 2.4035 2.3283 2.1517 1.5192 2.7172 3.1302 2.2468 2.7108 2.0074 2.1694 2.3070 2.2638 2.1946 2.6970 2.5081 2.4482 2.6631 2.1766 3.0408 3.0836 2.3451 3.4633 2.3798 2.7557 2.6703 3.3393 3.0203 3.2592 3.0754 3.2855 2.4152 3.0385 2.0525 1.6270 1.4020 1.6246 1.8874 1.8396 1.7244 1.7466 1.7729 1.6227 1.3788 1.6307 2.5982 2.1886 2.0265 1.2593 1.9695 2.2706 2.3955 2.0092 1.5910 2.4523 2.4750 2.1905 1.7981 1.9257 2.5043 1.8901 2.1837 1.6179 1.4359 1.6909 1.3384 1.5153 1.3702 1.9276 1.4518 1.5139 1.3188 1.4184 1.3327 1.2628 1.3680 1.1758 1.2317 1.3391 1.4376 1.3939 1.4046 1.4590 1.3849 1.2992 1.2413 1.2328 1.2528 1.2354 1.3578 1.0770 1.0535 1.0495 1.0779 1.0634 1.0653 1.0656 1.0632 1.0906 1.0626 1.0728 1.0874 1.0587 7.0507 7.9526 6.5022 6.6421 6.3273 1.0833 1.0805 1.0792 1.0379 1.0374 1.0632 1.0382 1.0481 1.0796 1.0660 1.0755 1.0591 1.0597 1.0623 1.0969 1.0965 1.0974 1.0999 1.0969 1.0949 1.1003 1.0965 1.0923 1.0994 1.0970 1.0984 1.0980 1.0962 1.0892 1.0915
irintensity: 1.1207 0.5445 0.4708 0.7711 1.7725 1.4194 0.3021 2.0115 0.8054 0.7232 2.6590 4.9457 2.6717 0.3246 1.8370 0.7799 1.3406 2.8349 3.8316 1.6409 9.5846 1.6116 0.2484 0.2153 6.3142 0.1701 0.3796 3.9384 6.5435 10.6096 3.2460 4.5737 2.9906 2.3553 5.5596 3.2874 1.2749 4.3115 5.1109 0.6159 12.0713 9.7700 34.0410 3.3601 1.6058 18.5808 10.9863 24.7510 13.0112 3.1770 29.6265 9.7968 16.5943 1.0562 8.8117 0.9365 15.5764 0.8353 0.1122 0.7073 7.7308 9.9754 9.1743 1.8431 9.5676 5.8545 8.5291 8.3210 1.5652 7.5489 7.9823 1.1714 0.6187 8.1893 6.1275 6.9675 18.0176 4.1858 14.7602 30.1909 2.0816 14.6248 3.1547 3.9314 7.7155 0.4073 5.6846 2.0872 0.1912 2.9348 1.6493 0.9875 3.9579 1.2492 0.7302 0.8985 13.5398 24.3114 18.6948 10.9450 19.6624 4.9933 6.9737 3.7746 14.5201 2.9530 11.5690 2.0841 6.6154 20.7448 5.2432 29.1137 13.5753 23.9727 0.8556 214.2510 143.2893 28.9084 5.3619 4.6651 104.4659 11.4621 35.5189 32.3827 34.4331 28.7285 39.7155 22.5474 32.5520 49.0095 39.2896 42.8267 17.0998 18.4488 38.9383 26.1119 2.6343 36.7003 38.6459 34.5877 14.3676 31.3420 21.6088 39.8223 45.3109 34.5406 27.4789 36.1398 2.2634 45.0339
temp: 298.150 k
press: 1.00000 atm
elementType: 8 8 6 6 6 6 6 6 6 6 6 6 6 6 6 6 6 6 6 6 6 6 1 1 1 1 1 1 1 1 1 1 1 1 1 1 1 1 1 1 1 1 1 1 1 1 1 1 1 1 1 1
symmnumber: 1
zpe: 1179372.3 jmol-1
zpe.correction: 0.449199 hartree
zpe.thermalcorrener: 0.473868 hartree
zpe.thermalcorrenthalpy: 0.474812 hartree
zpe.thermalcorrgfe: 0.395034 hartree
zpe.sumelectzpe: -928.776304 hartree
zpe.sumelectthermal: -928.751635 hartree
zpe.sumelectthermalent: -928.750691 hartree
zpe.sumelectthermalfe: -928.830469 hartree
dipole: 3.6452 4.5007 0.5473
dipole: 5.8175
quadrupole: -129.5892 -140.4677 -138.2655
quadrupole: -5.1043 2.3526 1.5701
quadrupole: 6.5183 -4.3602 -2.1580 -5.1043 2.3526 1.5701
hfenergy: -929.2255027 hartree
pointgroup: C01 [X(C20H30O2)]
dipole: -1.2489926 1.2098575 -1.4881968 debye
polarizability: 250.2368259|-17.8036121|196.8467488|1.7664902|-12.711656|216.209198 unknown
InChI: InChI=1S/C20H30O2/c1-15(2)7-5-9-17(4)19-12-11-16(3)8-6-10-18(13-21)20(19)14-22/h7-8,10,13-14,17,19-20H,5-6,9,11-12H2,1-4H3
charge 0 multiplicity 1
52 atoms
O  0.65971 -2.984136 -0.421534
O  0.725124 -0.519764 2.896857
C  -0.460476 0.426406 -1.351856
C  1.011464 0.969176 -1.209216
C  -0.728679 -0.932791 -0.56737
C  -1.516178 1.487593 -0.914529
C  2.02087 0.153484 -2.071335
C  -3.023506 1.099816 -1.114332
C  1.137312 2.468053 -1.591188
C  -0.728235 -0.809958 0.951877
C  3.51028 0.287125 -1.625182
C  -3.86094 1.416639 0.12305
C  0.065807 -2.117846 -1.107524
C  -1.866939 -0.748939 1.714271
C  -3.310844 -0.827178 1.252436
C  -3.963344 0.556993 1.17835
C  3.810747 -0.490873 -0.357703
C  0.587453 -0.775043 1.665015
C  -4.525618 2.780566 0.148858
C  4.08864 -0.009805 0.890052
C  4.314657 -0.95914 2.056895
C  4.160822 1.463025 1.253862
H  -0.6261 0.200009 -2.430814
H  1.312874 0.873856 -0.146318
H  -1.758451 -1.213761 -0.883385
H  -1.32614 2.417424 -1.475729
H  -1.344583 1.72356 0.152694
H  1.919577 0.480955 -3.127774
H  1.772912 -0.924658 -2.059487
H  -3.120023 0.027678 -1.369451
H  -3.428225 1.651622 -1.98376
H  0.719009 2.66138 -2.598309
H  0.631036 3.133285 -0.871193
H  2.200677 2.766852 -1.614062
H  3.778293 1.3539 -1.515741
H  4.14592 -0.10732 -2.444047
H  0.003112 -2.218751 -2.224022
H  -1.708057 -0.620594 2.795951
H  -3.386565 -1.334563 0.272645
H  -3.874713 -1.445501 1.975468
H  -4.530444 0.872733 2.064653
H  3.771129 -1.585836 -0.477523
H  1.480113 -1.009222 1.04716
H  -5.067643 2.959241 1.093552
H  -5.244879 2.887892 -0.68707
H  -3.776616 3.58849 0.025929
H  3.517057 -0.83685 2.816953
H  5.278172 -0.749091 2.562223
H  4.3184 -2.014225 1.732186
H  3.438859 1.69113 2.063042
H  3.947597 2.134333 0.405575
H  5.165077 1.717833 1.6469
