program: Gaussian 09
title: 000155507
version: EM64L-G09RevD.01
frameworkgroup: C1[X(C19H29NO9)]
method: RPBEPBE
basis: SDD
operation: Freq
keyword: #p
keyword: freq=noraman
keyword: PBEPBE/SDD
title: #p freq=noraman PBEPBE/SDD
converged: NO YES NO NO
title: Mulliken charges:
elementType: O O O O O O O O O N C C C C C C C C C C C C C C C C C C C H H H H H H H H H H H H H H H H H H H H H H H H H H H H H
charge: -0.283536 -0.282657 -0.458682 -0.453351 -0.434115 -0.467361 -0.336320 -0.432183 -0.287318 -0.185501 -0.143645 -0.095828 -0.204942 0.024762 -0.066276 -0.270334 0.190122 0.456876 -0.524741 -0.418182 0.037992 -0.345826 -0.336511 -0.616471 0.061019 -0.626906 0.220176 -0.519445 -0.518244 0.204930 0.238951 0.270313 0.228752 0.218668 0.209676 0.235736 0.266424 0.224856 0.206497 0.188942 0.219120 0.178398 0.232238 0.265267 0.235604 0.231854 0.205437 0.366336 0.368122 0.336586 0.403421 0.356631 0.226867 0.227369 0.265177 0.260195 0.227456 0.217601
chargesum: 0.00000
title: Mulliken charges with hydrogens summed into heavy atoms:
elementType: O O O O O O O O O N C C C C C C C C C C C C C C C C C C C
charge: -0.283536 -0.282657 -0.092346 -0.085229 -0.097528 -0.063940 -0.336320 -0.075552 -0.287318 -0.185501 0.061285 0.143124 0.065371 0.253514 0.152393 -0.060658 0.190122 0.456876 -0.022581 0.013172 0.037992 0.062236 0.074125 -0.351203 0.061019 0.045989 0.220176 0.199967 0.187008
polarizability: 2.91434274e+02 1.32461920e+01 2.67141497e+02 -6.71694462e+00 1.05872231e+01 1.85300147e+02
1716.lowfreq: -9.1026 -5.9692 -0.0003 -0.0002 0.0005 6.6253 20.0636 29.2062 32.6215
frequency: 19.9019 29.1210 32.4930 40.5008 52.9906 64.2010 79.8381 83.3921 89.3957 91.8128 97.9819 110.1177 115.9081 136.9278 147.7577 152.3988 159.9111 178.6723 187.0677 195.2390 208.0756 218.7931 221.3361 237.3149 246.6919 267.8441 272.1832 289.9175 304.0513 314.2163 327.7246 330.4774 342.9582 353.7365 364.8584 372.8511 388.1035 401.3419 412.1183 427.8849 439.2761 457.4884 459.2846 479.6662 506.1612 527.7071 542.3944 551.2425 573.3194 587.8381 605.9778 622.3462 643.5027 655.8102 693.2681 699.8274 705.9469 727.9486 775.5017 797.9867 823.0748 853.9757 868.7813 889.2095 901.1436 908.8863 929.2298 947.7840 963.9961 966.8950 974.8799 984.1572 998.6605 1004.4219 1011.9325 1015.3326 1018.6949 1035.0466 1041.6169 1046.1285 1074.0942 1078.0696 1082.5585 1092.9775 1096.0154 1103.3501 1112.7120 1113.9463 1115.2432 1133.5807 1153.0955 1157.3932 1161.3906 1180.1452 1182.5468 1195.9547 1198.1122 1202.2595 1208.8707 1221.1825 1224.3952 1236.5322 1246.4359 1263.5610 1275.6712 1288.9540 1296.0021 1304.3268 1315.2782 1322.3059 1327.5653 1333.9203 1339.3128 1342.3085 1350.2409 1359.4215 1362.4623 1369.2988 1371.3172 1382.8595 1397.2429 1399.0876 1408.5103 1419.4795 1436.7457 1439.7120 1445.4321 1454.8560 1455.4698 1464.1556 1470.5429 1472.0238 1476.2614 1477.2416 1483.7709 1485.6636 1490.2375 1573.3796 1605.9524 2887.4726 2895.0138 2902.6805 2906.5644 2917.8332 2932.9199 2944.0836 2953.7688 2981.0843 2987.4923 2992.6428 3003.3150 3031.0506 3036.5610 3066.9269 3067.5487 3074.9241 3083.1621 3089.2116 3090.5115 3096.5549 3128.8040 3130.0815 3142.5233 3209.3124 3355.0117 3529.3958 3541.9054 3543.0549
redmass: 5.8798 5.7320 5.3878 4.2408 5.2420 2.5194 4.8295 4.2208 2.5425 3.2106 6.4766 5.1687 2.1549 1.5487 3.7815 3.0442 1.9822 3.1109 3.7593 3.0179 1.8287 3.8682 2.0171 3.6489 2.5720 4.5743 4.0954 4.2921 3.5222 3.7453 1.6464 2.0771 4.4364 3.9741 5.8360 3.1465 3.1166 5.4029 1.5725 4.5194 2.2984 1.3651 3.1497 3.8046 5.2380 3.9434 3.8728 4.6157 4.2450 3.9692 4.0036 4.4956 5.1577 4.3239 1.9098 3.0506 1.6570 1.2163 4.4442 3.9537 3.5718 2.7295 2.9626 1.6628 5.2981 3.1493 5.2398 6.4781 4.7218 6.0730 3.1917 3.1652 3.4533 4.4865 2.2118 3.9842 3.2726 2.6897 3.1056 2.2948 2.0145 3.5031 3.0505 3.5313 3.3246 1.2539 2.2696 1.2490 1.4219 2.0594 1.3289 1.3356 1.3914 1.3091 1.2824 1.7616 1.4974 1.2760 1.9075 1.1726 1.6316 1.5546 1.2067 1.1803 1.6740 1.2068 2.8869 1.3330 1.4354 1.3204 1.5172 1.4105 1.5754 1.5678 1.3081 3.4097 1.1843 1.5608 1.5446 1.2527 2.2948 1.2326 1.8422 1.2842 1.2087 1.3289 1.1596 1.0915 1.0620 1.0920 1.0701 2.5310 1.0578 1.0570 1.0549 1.1150 1.0810 8.4722 7.8009 1.0704 1.0764 1.0562 1.0819 1.0820 1.0723 1.0841 1.0696 1.0337 1.0305 1.0666 1.0848 1.0905 1.0786 1.0921 1.0859 1.0944 1.0943 1.1006 1.0986 1.1027 1.1050 1.1047 1.0913 1.0629 1.0679 1.0659 1.0656 1.0655
irintensity: 0.5425 1.6122 0.4658 1.1152 1.4653 7.1062 1.5804 5.0855 9.9168 1.2694 4.4846 0.1687 0.2444 2.9589 0.1564 3.2066 1.9978 2.1940 2.9836 5.6333 0.2077 7.8063 1.3574 3.7537 0.6773 7.2902 6.8861 9.0209 7.7729 8.1434 25.5422 56.6512 2.1126 7.4157 1.4851 15.8310 3.4534 5.9214 85.5674 18.0831 27.1435 172.3736 41.2788 6.8120 10.0965 5.9968 12.5844 13.9651 6.7389 1.0014 11.2060 4.9803 3.8874 14.6107 32.4357 9.6194 137.4742 136.4702 8.1661 14.6966 11.0841 14.5137 12.2960 5.2774 15.5637 11.7014 94.2917 205.1983 156.2706 129.5710 19.7778 26.3957 118.1871 69.7112 19.2867 55.9086 42.8752 12.1611 101.8098 73.1923 18.0277 43.2081 34.0563 22.5669 21.3786 5.7876 2.2193 6.2754 17.5148 12.9024 17.5486 8.2753 37.2879 10.2952 12.9703 9.3146 46.6163 34.9933 2.9910 19.9019 5.8836 12.4242 19.4811 14.3294 1.4780 30.8006 119.5613 13.5533 55.0314 23.1076 31.0921 4.9903 13.5777 19.5834 12.4935 12.1357 22.4796 47.2657 0.8110 40.5213 68.5129 71.1473 14.5664 5.9211 7.9449 14.0543 21.5635 12.7804 10.8080 5.4946 9.1672 98.7043 18.6357 9.0297 18.0551 18.5354 14.0649 18.6189 19.9425 48.6187 18.2644 149.3824 15.6170 36.0527 172.3850 25.5506 82.0196 70.5673 66.8641 12.1829 32.4982 40.2468 45.5251 39.2822 13.7256 7.3868 36.9520 21.1966 32.3319 24.7758 12.9182 21.1064 5.0066 106.7445 284.2749 12.8263 16.4875 24.5010
temp: 298.150 k
press: 1.00000 atm
elementType: 8 8 8 8 8 8 8 8 8 7 6 6 6 6 6 6 6 6 6 6 6 6 6 6 6 6 6 6 6 1 1 1 1 1 1 1 1 1 1 1 1 1 1 1 1 1 1 1 1 1 1 1 1 1 1 1 1 1
symmnumber: 1
zpe: 1233094.4 jmol-1
zpe.correction: 0.469661 hartree
zpe.thermalcorrener: 0.500317 hartree
zpe.thermalcorrenthalpy: 0.501261 hartree
zpe.thermalcorrgfe: 0.407828 hartree
zpe.sumelectzpe: -1470.810960 hartree
zpe.sumelectthermal: -1470.780304 hartree
zpe.sumelectthermalent: -1470.779360 hartree
zpe.sumelectthermalfe: -1470.872794 hartree
dipole: 0.2465 -2.3051 -1.3226
dipole: 2.6690
quadrupole: -156.7775 -174.1883 -174.1644
quadrupole: -2.6698 10.9124 -1.2930
quadrupole: 11.5993 -5.8116 -5.7877 -2.6698 10.9124 -1.2930
hfenergy: -1471.2806213 hartree
pointgroup: C01 [X(C19H29N1O9)]
dipole: -0.2209008 -0.9099452 0.4751834 debye
polarizability: 288.2272483|-15.2807681|271.4259847|-5.8205081|-6.3335026|184.2226851 unknown
InChI: InChI=1S/C19H29NO9/c1-20-5-4-9-10(11(20)7-21)6-12(26-2)18(27-3)17(9)29-19-16(25)15(24)14(23)13(8-22)28-19/h6,11,13-16,19,21-25H,4-5,7-8H2,1-3H3
charge 0 multiplicity 1
58 atoms
O  -2.338793 0.643142 0.093672
O  -0.601958 -0.429361 1.186995
O  -4.621252 -2.770851 -0.179627
O  -1.828728 -3.01304 0.422688
O  -5.401162 -0.456863 -1.808711
O  -2.627176 3.080247 -0.997113
O  -0.404872 2.508714 1.020599
O  3.501565 -1.619551 -2.626696
O  2.083436 3.633743 0.189527
N  4.01653 -2.261608 -0.093774
C  -3.673113 -1.733251 -0.592386
C  -2.548831 -1.743086 0.46858
C  -4.368885 -0.363103 -0.754709
C  -1.570818 -0.608209 0.140484
C  -3.308083 0.724401 -1.016601
C  4.140729 -0.797912 -0.390381
C  1.710303 -0.593771 0.447256
C  2.915118 0.01722 0.020992
C  1.645749 -2.100147 0.613667
C  3.042844 -2.630642 0.965744
C  0.598964 0.229737 0.751317
C  -3.778558 2.187065 -0.950642
C  4.392213 -0.696512 -1.941302
C  2.984013 1.424838 -0.078762
C  0.664746 1.648171 0.686773
C  5.334247 -2.909754 0.090793
C  1.882314 2.243714 0.240869
C  -0.915394 2.380498 2.407195
C  1.13236 4.430516 -0.620162
H  -3.215853 -2.008694 -1.573794
H  -2.992865 -1.563634 1.469456
H  -4.942458 -0.121191 0.156775
H  -1.068891 -0.782554 -0.838069
H  -2.781731 0.538067 -1.983049
H  5.027502 -0.361593 0.127565
H  1.297836 -2.583959 -0.319876
H  0.912033 -2.367933 1.392235
H  3.025542 -3.73457 1.028029
H  3.353737 -2.242508 1.96609
H  -4.369657 2.32955 -0.01962
H  -4.412738 2.438152 -1.816331
H  5.457517 -0.93343 -2.159961
H  4.177027 0.321946 -2.304491
H  3.903924 1.926057 -0.399261
H  5.989561 -2.686524 -0.768564
H  5.203968 -4.004958 0.142418
H  5.851592 -2.57338 1.020208
H  -5.427276 -2.691753 -0.753539
H  -2.505948 -3.73522 0.495277
H  -4.955866 -0.519222 -2.694223
H  -1.955951 2.768069 -0.320497
H  3.41388 -2.367387 -1.950243
H  -1.705719 3.141541 2.494959
H  -0.100134 2.594157 3.122265
H  -1.328136 1.372426 2.572866
H  0.115131 4.383854 -0.200176
H  1.521807 5.459021 -0.578137
H  1.126056 4.072223 -1.667199
