program: Gaussian 09
title: 000155498
version: EM64L-G09RevD.01
frameworkgroup: C1[X(C15H22O2)]
method: RPBEPBE
basis: SDD
operation: Freq
keyword: #pfreq=noraman
keyword: PBEPBE/SDD
title: #p freq=noraman PBEPBE/SDD
converged: NO YES NO NO
title: Mulliken charges:
elementType: O O C C C C C C C C C C C C C C C H H H H H H H H H H H H H H H H H H H H H H
charge: -0.431244 -0.224385 0.281753 -0.116712 -0.585211 0.513152 -0.129023 -0.616245 -0.451855 -0.291818 -0.817914 -0.767759 -0.572484 0.168814 0.509841 -0.837859 -0.727274 0.199719 0.227316 0.223777 0.221862 0.231957 0.231155 0.240283 0.201620 0.219037 0.218741 0.233548 0.233797 0.252484 0.220263 0.222117 0.254051 0.323203 0.206462 0.277848 0.219071 0.215200 0.222708
chargesum: 0.00000
title: Mulliken charges with hydrogens summed into heavy atoms:
elementType: O O C C C C C C C C C C C C C C C
charge: -0.108040 -0.224385 0.281753 0.083008 -0.134117 0.513152 0.092839 -0.153132 -0.009952 -0.072781 -0.131829 -0.072895 -0.318433 0.168814 0.509841 -0.134478 -0.289365
polarizability: 2.00320015e+02 9.14080295e-01 1.53839998e+02 -3.14804301e+00 -9.46596531e+00 1.39144788e+02
1716.lowfreq: -9.4970 0.0002 0.0005 0.0006 5.8624 20.4241 42.3393 62.0948 77.1624
frequency: 41.8779 62.0589 77.1438 85.9640 142.0556 169.4538 195.7782 195.9860 207.0582 221.5229 238.0553 270.0521 284.0143 290.4295 307.4966 314.7705 325.5946 342.2171 359.9557 395.0777 404.5011 443.5085 464.5279 469.4117 481.0931 498.7249 546.4129 578.2364 629.5179 637.5014 683.6867 693.9777 715.3108 774.6471 814.0344 841.6898 871.2261 887.3675 894.4988 926.3565 936.1439 948.3844 967.5421 971.9283 982.5264 1000.5261 1005.7985 1010.5855 1050.4670 1053.4367 1072.1378 1091.2224 1110.5756 1118.3341 1124.4854 1129.7229 1153.8257 1191.0342 1198.4045 1214.4263 1217.9445 1234.2599 1235.6333 1281.6973 1289.1650 1294.7792 1305.8075 1314.3858 1341.4294 1344.8328 1347.7528 1352.5758 1369.9761 1385.8943 1386.8863 1396.1729 1427.6801 1459.6023 1464.0988 1466.1519 1471.8479 1475.6021 1484.4926 1487.7763 1493.8055 1497.1523 1582.7269 1633.1904 1667.7272 2915.4905 2927.2490 2965.2108 2966.9710 2984.7425 2987.1818 2991.2740 2993.7695 3032.5389 3049.7320 3055.2964 3056.0325 3060.9167 3075.0893 3084.0188 3089.0175 3089.7766 3093.5193 3101.3772 3118.0387 3198.5938 3535.3760
redmass: 4.3078 3.8314 4.0477 3.2053 3.7296 3.2497 1.0801 1.5851 2.1154 1.6653 2.0622 2.1657 2.6439 2.9785 2.4562 1.3561 2.6012 2.3740 2.9890 3.1443 3.2457 3.4292 2.8438 3.2154 3.3178 3.0930 3.5075 2.6811 3.0887 3.5534 1.4231 3.2351 2.5457 2.0049 2.1494 2.0947 1.9673 2.0946 1.7642 1.3340 1.7082 1.9472 2.1819 2.0837 2.2745 1.6090 1.4058 1.8873 1.5098 2.5226 1.7676 1.9821 1.8820 2.1770 2.3713 2.7105 1.7586 2.0111 1.5150 1.4102 1.6744 1.9907 1.6240 1.3516 1.6017 1.8142 1.4618 1.3286 1.6549 1.4222 1.8251 1.5896 1.1929 1.2014 1.2309 1.1979 1.1768 1.0585 1.0747 1.0833 1.0604 1.0732 1.0589 1.0621 1.0602 1.0641 10.2273 7.9955 4.8838 1.0790 1.0820 1.0390 1.0652 1.0420 1.0547 1.0415 1.0590 1.0856 1.0938 1.0965 1.0973 1.1021 1.0993 1.0980 1.0993 1.0986 1.0990 1.0629 1.0912 1.1132 1.0657
irintensity: 1.7451 0.2665 2.3509 0.8232 0.5997 1.6381 0.3648 2.5795 1.7750 2.1601 1.7703 0.3395 3.4881 1.4255 11.1001 95.2984 2.8620 1.0700 11.9006 3.0519 6.6912 1.4873 8.9414 5.1133 0.7641 1.7017 1.4745 8.4706 6.4963 0.9702 2.7067 7.7067 1.9414 3.1544 1.0763 11.1836 4.2836 15.0356 18.1249 59.2824 1.7370 10.7300 20.9543 40.8164 55.6988 4.5918 6.3078 28.4558 14.8914 9.8156 2.2838 0.2848 11.7036 9.7235 7.9026 0.9695 7.7575 60.9074 6.5796 8.6283 8.8552 23.7954 14.7872 0.5306 14.1785 24.2743 5.0953 4.8326 10.8748 2.1291 0.3028 3.0758 18.0065 23.4870 46.4090 22.8522 3.6982 20.6219 1.8200 14.9079 7.0039 25.5094 33.4686 7.1964 11.6765 0.2990 159.1579 131.7841 29.2952 14.4516 24.8253 32.7909 29.9017 6.0391 15.7072 33.9749 32.3438 21.5745 20.5758 28.4356 22.4733 35.2370 32.0364 28.4584 23.7610 24.7036 26.0560 7.0819 11.3401 26.1916 7.1241
temp: 298.150 k
press: 1.00000 atm
elementType: 8 8 6 6 6 6 6 6 6 6 6 6 6 6 6 6 6 1 1 1 1 1 1 1 1 1 1 1 1 1 1 1 1 1 1 1 1 1 1
symmnumber: 1
zpe: 880430.9 jmol-1
zpe.correction: 0.335338 hartree
zpe.thermalcorrener: 0.352734 hartree
zpe.thermalcorrenthalpy: 0.353678 hartree
zpe.thermalcorrgfe: 0.291776 hartree
zpe.sumelectzpe: -733.893930 hartree
zpe.sumelectthermal: -733.876535 hartree
zpe.sumelectthermalent: -733.875590 hartree
zpe.sumelectthermalfe: -733.937492 hartree
dipole: -2.8022 -0.8187 0.2602
dipole: 2.9309
quadrupole: -120.8434 -109.4855 -97.8104
quadrupole: -15.1238 -3.4091 -1.3728
quadrupole: -11.4637 -0.1057 11.5694 -15.1238 -3.4091 -1.3728
hfenergy: -734.2292684 hartree
pointgroup: C01 [X(C15H22O2)]
dipole: 1.1013013 -0.2717194 -0.2072108 debye
polarizability: 200.0237754|1.0991552|149.0373974|-5.310112|11.6218362|144.2436287 unknown
InChI: InChI=1S/C15H22O2/c1-9(2)12-8-15(4)10(3)13(16)6-5-11(15)7-14(12)17/h7,10,12-13,16H,1,5-6,8H2,2-4H3
charge 0 multiplicity 1
39 atoms
O  3.752733 -1.292251 1.261494
O  -2.705594 1.836931 0.910456
C  0.688811 -0.103257 -0.85975
C  1.56603 -1.053093 0.063592
C  -0.78262 -0.595557 -0.99496
C  0.723082 1.291898 -0.222732
C  2.985812 -0.454779 0.313191
C  2.093036 1.924766 -0.107554
C  2.961394 1.008423 0.80531
C  -1.675026 -0.327839 0.240906
C  1.270949 -0.033029 -2.307086
C  1.690681 -2.501069 -0.46079
C  -0.384201 1.879988 0.329682
C  -1.68782 1.20169 0.503949
C  -3.073491 -0.945836 0.180413
C  -3.821429 -0.997217 1.499438
C  -3.619377 -1.421996 -0.970271
H  1.061521 -1.087765 1.056516
H  -0.7966 -1.674865 -1.228449
H  -1.230669 -0.079758 -1.867785
H  3.584356 -0.531856 -0.612458
H  2.57906 2.017949 -1.097518
H  2.027398 2.937937 0.326797
H  3.997364 1.388264 0.866645
H  2.538636 1.032693 1.831984
H  -1.164989 -0.759547 1.133939
H  2.358436 0.15043 -2.334576
H  1.077463 -0.981021 -2.839971
H  0.776027 0.775243 -2.876015
H  2.374477 -3.06762 0.194642
H  0.718884 -3.023787 -0.478875
H  2.115456 -2.526636 -1.480721
H  -0.330004 2.899112 0.734786
H  3.327652 -1.2174 2.15518
H  -3.238272 -1.542672 2.26852
H  -3.985063 0.029396 1.875154
H  -4.80038 -1.494671 1.391922
H  -4.624441 -1.859417 -0.977461
H  -3.099382 -1.387981 -1.933142
