program: Gaussian 09
title: 000014014
version: EM64L-G09RevD.01
frameworkgroup: C1[X(C2H8O2Si)]
method: RPBEPBE
basis: SDD
operation: Freq
keyword: #p
keyword: freq=noraman
keyword: PBEPBE/SDD
title: #p freq=noraman PBEPBE/SDD
converged: YES YES NO NO
title: Mulliken charges:
elementType: Si O O C C H H H H H H H H
charge: 1.411755 -0.760054 -0.759680 -1.050758 -1.072498 0.246030 0.244603 0.271690 0.252448 0.235137 0.251874 0.364850 0.364604
chargesum: 0.00000
title: Mulliken charges with hydrogens summed into heavy atoms:
elementType: Si O O C C
charge: 1.411755 -0.395205 -0.395077 -0.288435 -0.333038
polarizability: 5.44832037e+01 1.48826263e+00 4.83611862e+01 -1.41920386e-01 -3.89750072e-02 4.78577035e+01
1716.lowfreq: -15.1283 -8.9063 0.0013 0.0017 0.0028 5.8136 70.0197 131.8894 162.5475
frequency: 69.9623 131.8827 162.5459 178.5272 222.7311 244.1761 276.3833 293.4988 317.6918 594.2370 686.6121 689.4639 733.2985 788.1070 802.7161 843.5143 889.6642 936.5313 950.1476 1317.4053 1326.4366 1438.7498 1443.2601 1446.9506 1453.3968 2984.4970 3004.3425 3082.3681 3094.6588 3111.1502 3111.6423 3709.9688 3713.5574
redmass: 1.0872 1.1491 1.0526 2.4184 2.5261 2.6723 1.6282 3.8220 2.1352 4.9455 2.1424 2.1359 2.4337 1.5546 1.4299 1.3376 1.5692 1.8587 1.7923 1.2067 1.2035 1.0502 1.0514 1.0485 1.0459 1.0353 1.0349 1.0971 1.0983 1.0986 1.0983 1.0677 1.0674
irintensity: 19.6433 31.0482 1.4094 5.9081 38.6587 0.5322 69.5458 32.3827 226.9510 10.2265 211.5689 228.7640 15.1422 11.3582 24.2141 10.4320 151.3869 116.1620 114.0660 61.8444 36.0830 4.6590 0.3678 9.5928 18.8210 10.0689 4.9131 17.0944 11.4384 11.4252 8.7030 28.0884 22.0514
temp: 298.150 k
press: 1.00000 atm
elementType: 14 8 8 6 6 1 1 1 1 1 1 1 1
symmnumber: 1
zpe: 263478.0 jmol-1
zpe.correction: 0.100353 hartree
zpe.thermalcorrener: 0.109088 hartree
zpe.thermalcorrenthalpy: 0.110032 hartree
zpe.thermalcorrgfe: 0.067973 hartree
zpe.sumelectzpe: -520.490423 hartree
zpe.sumelectthermal: -520.481689 hartree
zpe.sumelectthermalent: -520.480745 hartree
zpe.sumelectthermalfe: -520.522803 hartree
dipole: -2.9441 0.2446 -0.0087
dipole: 2.9542
quadrupole: -36.5582 -35.8488 -41.2908
quadrupole: 5.4809 -0.4867 -0.3705
quadrupole: 1.3411 2.0504 -3.3915 5.4809 -0.4867 -0.3705
hfenergy: -520.5907763 hartree
pointgroup: C01 [X(C2H8O2Si1)]
dipole: 1.1604848 -0.0573244 -0.0297636 debye
dipolederiv: 1.6648074 -0.0452018 0.0095136 0.0703536 1.7559221 -0.0016539 -0.001627 -0.0014453 1.7688146 -0.6159082 0.1635986 -0.0416385 0.1230741 -0.8841409 0.1418669 0.0208398 0.1785412 -1.0741856 -0.6105943 0.1427384 -0.0212805 0.0940715 -0.9673177 -0.1731072 -0.0753141 -0.209806 -0.993895 -0.5032631 -0.081202 0.0189279 -0.0165791 -0.3429784 0.0098818 0.0130866 0.0112577 -0.2569034 -0.5305992 0.1260357 -0.0051029 0.0645876 -0.4010587 0.0062959 0.0013254 0.0037873 -0.3146344 0.1197747 -0.0301509 -0.0281593 -0.0250836 0.0050472 -0.1173459 -0.0250922 -0.1115081 -0.0024858 0.1238732 -0.0147399 0.0169581 -0.0093405 0.0447598 0.1101417 0.0129413 0.1057811 -0.0488385 -0.0559086 0.1179677 -0.0017358 0.0755521 0.0727015 0.0006774 0.0022927 -0.0009772 0.1261645 0.116088 0.0325874 0.0324683 0.0167973 -0.0132573 -0.1260039 0.0200903 -0.1170424 -0.0074526 -0.0980212 -0.1306581 0.0229083 -0.1050277 0.0440929 0.0117929 0.0194902 0.0129204 0.1103886 0.1098289 0.0322984 -0.0510609 0.0205254 0.038342 0.114913 -0.0361969 0.1049821 -0.0544785 0.1461616 -0.155616 0.053922 -0.1525794 0.3257287 0.0379362 0.050489 0.03328 0.3668666 0.133761 -0.1576575 -0.0057203 -0.1563512 0.3221587 -0.0153948 -0.0023251 -0.0097708 0.3806393 unknown
polarizability: 54.3592538|1.680936|48.4610704|-0.3910326|-0.1269403|47.8817692 unknown
InChI: InChI=1S/C2H8O2Si/c1-5(2,3)4/h3-4H,1-2H3
charge 0 multiplicity 1
13 atoms
Si -0.042088 -0.102142 -0.090298
O  -0.186461 0.701226 -1.619326
O  -0.071585 1.016823 1.233662
C  -1.626058 -1.094043 0.081571
C  1.586732 -1.085357 -0.046271
H  -1.738548 -1.80981 -0.750584
H  -1.646511 -1.649612 1.034737
H  -2.491393 -0.409613 0.064899
H  1.621038 -1.825201 -0.86623
H  2.467713 -0.424869 -0.155194
H  1.69225 -1.628444 0.910188
H  0.517773 1.255157 -2.018192
H  0.67124 1.615185 1.462338
