program: Gaussian 09
title: 000155468
version: EM64L-G09RevD.01
frameworkgroup: C1[X(C16H16N2O2)]
method: RPBEPBE
basis: SDD
operation: Freq
keyword: #p
keyword: freq=noraman
keyword: PBEPBE/SDD
title: #p freq=noraman PBEPBE/SDD
converged: YES YES NO NO
title: Mulliken charges:
elementType: O O N N C C C C C C C C C C C C C C C C H H H H H H H H H H H H H H H H
charge: -0.345267 -0.261189 -0.473773 -0.459416 0.076565 0.312435 0.315644 0.267683 0.197747 -0.326607 -0.335195 -0.338781 -0.382095 -0.847202 -0.278756 -0.223195 -0.231236 -0.247555 0.204802 -0.781452 0.340502 0.202720 0.311958 0.317495 0.229565 0.249098 0.232777 0.227011 0.379570 0.232492 0.234652 0.229043 0.229301 0.252941 0.252545 0.235174
chargesum: 0.00000
title: Mulliken charges with hydrogens summed into heavy atoms:
elementType: O O N N C C C C C C C C C C C C C C C C
charge: -0.345267 -0.261189 -0.133271 -0.079846 0.076565 0.312435 0.315644 0.267683 0.197747 -0.123887 -0.023238 -0.021287 -0.152531 -0.138316 -0.046264 0.011456 -0.002193 -0.018253 0.204802 -0.040791
polarizability: 3.18557510e+02 7.97512951e+00 2.37373311e+02 2.32891222e+00 5.21835840e+00 9.09064161e+01
1716.lowfreq: -3.4098 -0.0009 -0.0008 -0.0006 2.0611 7.5741 20.6325 37.8057 44.7915
frequency: 20.4026 37.7935 44.7782 64.4741 77.3112 88.6604 108.5235 137.3217 155.3426 177.1240 186.8306 214.0855 225.7965 269.3281 303.9450 312.8348 349.7867 392.4166 421.8979 429.7996 446.7471 464.4498 519.1657 526.7295 539.7015 542.0136 588.6395 602.4489 641.7387 651.8881 676.6350 685.7194 729.2669 757.5761 761.4007 769.6326 779.6088 823.7754 842.3592 866.2055 883.1376 886.9580 931.4944 941.3965 953.7011 957.4340 979.8991 998.8363 1003.4574 1007.7238 1042.1102 1042.4939 1045.7164 1047.7452 1068.7469 1113.4381 1140.5476 1174.5303 1181.3332 1195.7634 1229.1635 1235.7013 1259.9778 1273.3234 1301.0724 1313.7875 1366.6438 1381.2315 1388.7165 1397.0276 1432.4799 1437.6708 1440.6107 1453.0450 1467.2599 1467.6792 1482.0934 1487.2112 1508.0968 1529.2159 1571.4722 1583.0922 1598.7369 1618.1685 1619.3948 1642.9926 2951.9243 2998.3700 3020.6558 3088.5888 3095.7645 3106.1097 3113.7684 3124.5521 3139.1872 3140.5153 3162.2543 3164.3355 3187.8402 3194.3268 3202.3203 3549.9299
redmass: 4.2572 5.7017 1.1406 4.0628 5.2401 3.1952 4.8318 5.0678 4.2653 3.3968 1.0934 6.0780 4.7562 4.0421 4.6144 4.3417 4.4317 7.1051 4.1989 3.7622 3.0152 4.8345 4.1556 3.6032 3.0547 5.1407 6.5231 3.1893 2.5577 1.8700 6.3250 4.1565 2.7795 1.7261 5.1109 1.3570 2.6938 4.7682 4.5294 5.4331 1.2988 1.5212 2.1384 1.7101 1.3764 1.3663 1.5702 1.3090 1.6001 1.3182 3.0448 1.5341 1.6266 2.1197 2.7984 1.8813 1.7982 1.0917 1.0839 1.9703 3.2243 2.4831 1.9488 1.9775 1.7677 2.0072 6.0248 6.5471 1.2226 1.2961 3.0883 2.3648 2.1949 1.0462 1.1442 1.6717 1.0548 1.5644 2.8715 2.0269 5.1788 5.5765 4.5988 6.9105 5.5480 2.3043 1.0404 1.0356 1.0979 1.0943 1.0977 1.1017 1.0878 1.0871 1.0905 1.0891 1.0988 1.0977 1.0957 1.0828 1.0945 1.0751
irintensity: 0.0723 0.0318 2.1676 1.0392 1.6573 5.7271 3.7423 5.6081 3.8531 1.3361 0.8909 3.2641 1.6231 1.9056 2.7172 3.4111 4.3128 6.5871 4.5072 0.6905 8.8850 14.0038 5.7751 8.2982 5.6169 7.3114 13.7125 0.1745 31.0359 22.0522 1.7537 31.2505 2.2121 46.0577 2.7561 113.9370 7.9929 2.3547 3.2982 9.0866 2.2119 5.1819 38.8434 65.9490 4.2201 8.0252 3.4978 2.7665 8.8030 4.4691 13.7751 5.7802 26.6194 18.3959 1.0382 1.5023 0.9083 0.8636 10.0116 6.1033 60.3140 152.9478 2.1297 53.6964 138.9778 73.4325 320.8748 30.9600 74.3425 21.2037 243.2537 111.6794 13.6043 15.4569 15.9564 40.6290 14.9635 99.7640 676.3255 229.4331 7.7675 362.9231 19.6152 57.0011 57.3085 0.5996 28.2244 7.7933 21.6755 20.8803 8.2773 20.7937 14.0670 8.4103 17.9304 14.0549 36.7301 19.3295 12.0540 399.8196 8.3089 24.6611
temp: 298.150 k
press: 1.00000 atm
elementType: 8 8 7 7 6 6 6 6 6 6 6 6 6 6 6 6 6 6 6 6 1 1 1 1 1 1 1 1 1 1 1 1 1 1 1 1
symmnumber: 1
zpe: 750997.2 jmol-1
zpe.correction: 0.286040 hartree
zpe.thermalcorrener: 0.304301 hartree
zpe.thermalcorrenthalpy: 0.305245 hartree
zpe.thermalcorrgfe: 0.237943 hartree
zpe.sumelectzpe: -877.884887 hartree
zpe.sumelectthermal: -877.866626 hartree
zpe.sumelectthermalent: -877.865682 hartree
zpe.sumelectthermalfe: -877.932985 hartree
dipole: -4.2655 2.5558 0.1277
dipole: 4.9742
quadrupole: -125.5263 -98.6479 -123.0389
quadrupole: -1.8910 -4.6488 1.2428
quadrupole: -9.7886 17.0898 -7.3012 -1.8910 -4.6488 1.2428
hfenergy: -878.1709272 hartree
pointgroup: C01 [X(C16H16N2O2)]
dipole: 1.4466225 -1.1512587 0.6416693 debye
polarizability: 318.2304284|-11.3245723|200.8963201|-3.1116365|-63.5047457|127.7104878 unknown
InChI: InChI=1S/C16H16N2O2/c1-11-7-3-5-9-14(11)18-16(20)13-8-4-6-10-15(13)17-12(2)19/h3-10,17-18H,1-2H3
charge 0 multiplicity 1
36 atoms
O  0.16878 1.15315 -0.923683
O  -4.625315 2.310342 -0.343514
N  1.206478 -0.440289 0.436672
N  -2.401878 1.547099 -0.542986
C  -1.238003 -0.467267 0.242702
C  2.585698 -0.14156 0.227024
C  -2.463354 0.275257 0.065463
C  3.534977 -0.901929 0.984521
C  0.082108 0.138707 -0.13692
C  -1.318138 -1.784341 0.776674
C  3.025448 0.852995 -0.686219
C  -3.695006 -0.292396 0.502173
C  4.909749 -0.635749 0.795662
C  3.089005 -1.97378 1.967017
C  -2.540708 -2.34631 1.184421
C  -3.726329 -1.582925 1.058535
C  4.40609 1.090452 -0.850294
C  5.355927 0.350952 -0.112751
C  -3.427657 2.476889 -0.72679
C  -2.989168 3.750145 -1.44573
H  1.023926 -1.158324 1.138698
H  -0.418614 -2.409791 0.835668
H  2.283787 1.424435 -1.245057
H  -4.604063 0.300459 0.385984
H  5.641394 -1.214486 1.371938
H  3.962099 -2.440096 2.45169
H  2.453287 -1.564906 2.77857
H  2.524608 -2.790019 1.471018
H  -1.452238 1.764844 -0.911261
H  -2.573001 -3.365752 1.581515
H  -4.685718 -2.003404 1.379333
H  4.734851 1.859729 -1.557574
H  6.427575 0.53732 -0.239326
H  -3.185553 4.61716 -0.791166
H  -3.605336 3.880508 -2.352175
H  -1.923905 3.749679 -1.730733
