program: Gaussian 09
title: 000155467
version: EM64L-G09RevD.01
frameworkgroup: C1[X(C20H25NO4)]
method: RPBEPBE
basis: SDD
operation: Freq
keyword: #p
keyword: freq=noraman
keyword: PBEPBE/SDD
title: #p freq=noraman PBEPBE/SDD
converged: YES YES NO NO
title: Mulliken charges:
elementType: O O O O N C C C C C C C C C C C C C C C C C C C C H H H H H H H H H H H H H H H H H H H H H H H H H
charge: -0.269192 -0.284337 -0.295437 -0.247929 -0.122445 -0.485485 -0.015329 -0.011079 -0.315672 -0.688887 -0.704297 0.241182 0.281389 -0.800326 0.122342 0.432851 0.296197 -0.384864 -0.370302 -0.453131 -0.241999 -0.421799 -0.236940 -0.762400 -0.237701 0.267674 0.236774 0.250362 0.216059 0.214115 0.264573 0.206953 0.266770 0.207279 0.211638 0.202368 0.273252 0.235515 0.222928 0.270903 0.252432 0.258751 0.238764 0.225971 0.238762 0.228507 0.253867 0.254291 0.248999 0.228084
chargesum: 0.00000
title: Mulliken charges with hydrogens summed into heavy atoms:
elementType: O O O O N C C C C C C C C C C C C C C C C C C C C
charge: -0.269192 -0.284337 -0.295437 -0.247929 -0.122445 0.018963 0.235032 0.204980 0.163016 -0.007885 -0.017039 0.241182 0.281389 -0.070981 0.122342 0.432851 0.296197 -0.132431 -0.111551 -0.214367 -0.016028 -0.183036 -0.008433 -0.005242 -0.009617
polarizability: 2.82288363e+02 8.29850734e+00 2.28109888e+02 -2.51151196e+00 4.51168702e+01 2.07153142e+02
1716.lowfreq: -6.6050 -0.0005 -0.0003 0.0005 1.3328 6.1344 14.2295 18.6694 20.3034
frequency: 14.1565 18.2599 20.2465 24.9559 37.2841 46.6415 62.2995 65.5543 80.1499 106.4730 108.6305 127.4025 149.2152 164.3414 168.9959 178.1741 187.7605 200.5100 219.6217 227.6539 245.3054 263.3021 279.3775 291.0378 336.6494 357.4125 405.7207 413.7209 420.1976 437.6528 459.5208 462.7681 471.5504 474.6769 479.5449 523.1866 545.6551 572.5370 573.1868 587.9024 612.2213 619.3997 641.5011 652.9321 704.7409 742.1502 760.0631 771.9656 782.5708 784.0304 807.1990 836.6692 859.8534 866.7535 892.0035 895.7785 910.7707 918.0399 927.8288 937.6244 940.7506 962.7992 975.6278 991.2690 994.9578 1000.4135 1018.4230 1025.2750 1030.1546 1042.8626 1058.8164 1072.8108 1088.3639 1107.9051 1141.3434 1148.0572 1153.9882 1156.6338 1171.9549 1186.8470 1198.8377 1207.5078 1209.9723 1232.0124 1239.0381 1246.1893 1268.4399 1292.8928 1316.5577 1335.7200 1345.4442 1360.7456 1366.7894 1368.3531 1376.2003 1381.9509 1382.6425 1384.9576 1405.3024 1422.9736 1427.6020 1440.7737 1445.7824 1450.9033 1452.6482 1453.3876 1454.2599 1467.0998 1471.4874 1475.4355 1476.8751 1482.4730 1499.1457 1517.7279 1584.0520 1594.4400 1597.8757 1636.8638 1648.9055 2958.5676 2983.7110 2983.7717 2987.6536 3007.3079 3023.8363 3027.4261 3032.7852 3037.1050 3069.8221 3072.8455 3078.3358 3086.9076 3094.8222 3109.8970 3117.9048 3122.9331 3127.7267 3130.1213 3136.6643 3144.3010 3150.8953 3155.5085 3170.6202 3172.7631
redmass: 1.7575 2.5292 2.4506 4.5785 5.5788 5.1376 4.0812 3.8727 3.9589 3.4601 3.7950 4.4412 4.9734 4.0686 1.0414 4.1839 3.0219 1.7093 2.3801 1.5976 1.7097 4.1520 4.4832 2.8971 2.8095 2.8261 3.4093 2.6275 3.1038 4.3732 2.6912 2.7902 3.3733 3.5633 5.4545 6.3553 4.2853 3.4174 3.4486 3.2862 4.4758 4.3815 3.2705 3.8000 4.9514 1.3288 4.7131 3.4523 1.6698 5.1167 1.8611 3.8105 2.9742 1.5157 1.7346 4.8252 2.1766 1.2011 4.4091 1.8211 1.5096 1.3398 1.3768 1.8777 1.3336 1.8325 2.6346 1.8384 2.1358 1.6690 2.3105 2.8244 2.3345 2.0716 2.3746 1.4439 2.5142 2.3294 1.0786 1.3074 2.9647 2.9802 1.1451 1.8075 2.1648 1.6600 1.7920 1.4533 1.3595 1.6722 1.3201 1.4038 1.2189 1.3778 1.2324 2.0136 1.2369 1.2550 3.1968 1.5882 5.3911 2.4790 1.1017 1.0621 1.4998 1.3653 1.0454 1.1045 1.1263 1.0726 1.1340 1.0524 1.0618 3.8592 7.0135 5.6536 5.6565 7.0032 9.1548 1.0605 1.0375 1.0373 1.0372 1.0370 1.0765 1.0811 1.0731 1.1003 1.0980 1.0997 1.0988 1.1023 1.0972 1.0996 1.0986 1.0861 1.0976 1.0862 1.0899 1.1008 1.0939 1.0958 1.0961 1.0976
irintensity: 0.9949 0.8273 0.5485 0.0039 0.6307 1.0998 1.2244 2.1551 1.5189 3.8546 4.2604 2.0357 3.4521 7.4318 0.0563 2.1575 1.0938 1.9769 2.1221 2.3615 0.6146 0.2537 2.4030 0.6120 3.4527 2.2317 2.1286 2.1740 6.1109 4.3116 1.0745 5.3715 2.7423 13.7440 1.9602 1.4954 0.2815 3.2428 13.6486 9.8420 3.3008 14.5471 0.7036 7.3125 11.2415 1.1609 17.0949 11.3706 81.6848 0.8744 64.3930 4.5516 5.1021 0.5094 15.8672 27.8223 3.7482 8.6398 57.6217 14.4530 2.9763 0.1584 5.2480 53.0391 0.4669 36.2405 9.6593 17.7368 4.3602 13.9326 102.3253 47.4668 66.1317 32.7022 13.4222 11.3326 24.3230 3.6980 2.7606 42.1612 280.1470 67.8715 27.7079 83.2030 106.7786 12.8360 35.4585 7.0348 8.4299 111.8364 11.1865 23.5694 27.1864 19.6024 38.5166 17.7815 33.1675 62.3127 28.6713 35.4826 29.5538 11.5077 69.9749 16.8273 13.3511 48.1106 8.5595 29.7172 2.9713 23.0167 12.2605 2.2794 8.6806 31.0078 109.8078 231.6853 5.7301 4.6486 163.8913 31.7500 27.8017 23.9003 22.4803 1.3165 12.4401 4.4588 37.3221 20.1499 15.9053 25.2054 61.3055 13.7844 6.1280 5.0239 18.5510 1.2067 13.0662 1.0738 13.4599 9.0525 30.2072 34.6162 22.6192 9.3815
temp: 298.150 k
press: 1.00000 atm
elementType: 8 8 8 8 7 6 6 6 6 6 6 6 6 6 6 6 6 6 6 6 6 6 6 6 6 1 1 1 1 1 1 1 1 1 1 1 1 1 1 1 1 1 1 1 1 1 1 1 1 1
symmnumber: 1
zpe: 1076083.3 jmol-1
zpe.correction: 0.409858 hartree
zpe.thermalcorrener: 0.435671 hartree
zpe.thermalcorrenthalpy: 0.436616 hartree
zpe.thermalcorrgfe: 0.349973 hartree
zpe.sumelectzpe: -1130.927591 hartree
zpe.sumelectthermal: -1130.901778 hartree
zpe.sumelectthermalent: -1130.900834 hartree
zpe.sumelectthermalfe: -1130.987477 hartree
dipole: -3.7033 0.3189 -0.9630
dipole: 3.8397
quadrupole: -167.6921 -153.3181 -136.9987
quadrupole: 5.2388 -11.1137 5.4699
quadrupole: -15.0225 -0.6484 15.6709 5.2388 -11.1137 5.4699
hfenergy: -1131.3374494 hartree
pointgroup: C01 [X(C20H25N1O4)]
dipole: -1.5002575 -0.131341 -0.118493 debye
polarizability: 277.2937996|1.3093244|262.0815381|-24.8114739|-12.1395455|178.1760547 unknown
InChI: InChI=1S/C20H25NO4/c1-14(2)21(15(3)22)12-18(25-16(4)23)13-24-20-11-7-9-17-8-5-6-10-19(17)20/h5-11,14,18H,12-13H2,1-4H3
charge 0 multiplicity 1
50 atoms
O  1.340518 0.06391 -1.7650
O  -0.937965 0.493752 0.115302
O  5.462184 -0.081541 1.18487
O  1.547744 1.97669 -3.084554
N  3.241799 -0.388811 0.537234
C  1.823937 0.011141 0.615545
C  1.36022 0.921255 -0.540429
C  3.561545 -1.650987 -0.220844
C  -0.014069 1.552973 -0.302091
C  4.020638 -2.777327 0.735172
C  4.571354 -1.407255 -1.365328
C  4.251823 0.310261 1.196315
C  -2.266205 0.862999 0.391445
C  3.860115 1.580477 1.961393
C  -3.128205 -0.225509 0.784012
C  -4.50825 0.072439 1.102613
C  1.455737 0.731301 -2.995848
C  -2.748372 2.17468 0.309827
C  -2.661502 -1.57664 0.86519
C  -4.981306 1.425215 1.014847
C  -4.116938 2.446474 0.62447
C  -5.368151 -1.004845 1.498801
C  -3.526879 -2.603469 1.253711
C  1.443388 -0.259947 -4.135277
C  -4.890698 -2.31541 1.574676
H  1.18915 -0.891233 0.621618
H  1.627181 0.539571 1.563834
H  2.079193 1.743751 -0.71792
H  2.602017 -1.947774 -0.682363
H  0.070601 2.3176 0.499334
H  -0.374091 2.0457 -1.225036
H  4.161581 -3.715402 0.167117
H  4.975144 -2.507671 1.214684
H  3.266131 -2.961656 1.52201
H  4.218417 -0.601195 -2.033648
H  4.680281 -2.33214 -1.962044
H  5.556302 -1.125559 -0.962011
H  3.288922 1.340468 2.878295
H  3.259936 2.284086 1.357019
H  4.794959 2.077031 2.260141
H  -2.100071 3.001826 0.008171
H  -1.618592 -1.787077 0.612201
H  -6.027751 1.641283 1.25708
H  -4.47805 3.478212 0.554703
H  -6.413554 -0.780369 1.741979
H  -3.162881 -3.635046 1.312666
H  0.469438 -0.77914 -4.17092
H  2.220047 -1.028816 -3.982555
H  1.615701 0.264744 -5.085674
H  -5.559374 -3.128218 1.878868
