program: Gaussian 09
title: 000155453
version: EM64L-G09RevD.01
frameworkgroup: C1[X(C14H14Cl2N2O3)]
method: RPBEPBE
basis: SDD
operation: Freq
keyword: #p
keyword: freq=noraman
keyword: PBEPBE/SDD
title: #p freq=noraman PBEPBE/SDD
converged: YES YES NO NO
title: Mulliken charges:
elementType: Cl Cl O O O N N C C C C C C C C C C C C C C H H H H H H H H H H H H H H
charge: -0.037912 -0.035915 -0.229166 -0.208974 -0.178762 -0.236000 -0.363536 -0.144345 -0.472544 0.239884 -0.371132 0.268793 0.171673 -0.708238 0.523202 -0.704188 -0.322097 -0.319296 -0.072792 -0.075745 -0.251085 0.269296 0.294441 0.294527 0.222744 0.198895 0.230004 0.225529 0.234469 0.207439 0.234104 0.220623 0.305866 0.303074 0.287162
chargesum: 0.00000
title: Mulliken charges with hydrogens summed into heavy atoms:
elementType: Cl Cl O O O N N C C C C C C C C C C C C C C
charge: -0.037912 -0.035915 -0.229166 -0.208974 -0.178762 -0.236000 -0.363536 0.124951 0.116424 0.239884 0.050508 0.268793 0.171673 -0.018236 0.523202 -0.042022 -0.016231 -0.016221 -0.072792 -0.075745 0.036077
polarizability: 2.66904089e+02 -3.81178947e-01 2.14572981e+02 -1.17624145e+01 -2.11244942e+00 1.13602181e+02
1716.lowfreq: -4.0807 -1.7558 0.0013 0.0014 0.0021 7.4779 16.4856 30.7445 41.2480
frequency: 16.3963 30.6785 41.2460 58.0526 62.9907 101.6188 115.0029 126.5170 130.7233 155.8892 165.6608 177.3340 198.4641 204.2805 219.9793 231.4409 253.9898 267.9969 273.6310 300.4151 311.2403 354.1942 383.4193 403.6789 413.1898 426.0553 451.4102 491.9255 510.9542 539.3907 587.7431 601.8118 640.5185 662.4764 678.2828 709.9124 722.4432 733.6833 759.1124 792.2266 824.0998 859.6314 864.1616 871.3664 876.1633 964.5320 974.8221 983.7061 986.9922 999.9502 1019.6149 1025.4738 1088.1913 1094.9822 1107.1451 1113.9871 1115.0095 1164.1821 1166.7445 1173.9730 1202.9740 1217.7987 1264.6469 1266.9390 1273.3743 1319.5026 1331.8221 1338.9354 1365.3375 1375.4726 1386.1498 1393.4769 1421.1737 1445.1924 1453.4737 1457.6749 1474.8733 1477.3007 1479.8231 1488.6436 1567.7677 1598.7325 1605.1446 1654.7671 1704.5381 2978.4817 2987.5027 2992.3192 3030.3793 3031.8159 3049.8978 3075.7729 3082.2532 3084.6972 3090.2173 3093.1539 3189.0910 3206.5302 3208.1640
redmass: 7.0301 4.3709 6.6061 7.7617 5.4700 2.5775 4.1639 7.6094 6.5536 7.0337 5.3386 3.2003 4.5765 1.4621 1.2770 2.4669 5.0060 8.4478 3.5667 4.7553 3.9050 5.6668 12.8911 4.8929 8.4487 3.0620 5.3242 7.1385 5.1193 3.8768 4.4710 8.9413 2.9337 2.7126 4.5143 7.2538 6.8692 4.9979 10.6834 1.6321 2.4484 1.9996 1.8362 1.3860 1.5998 1.6572 2.7741 3.4838 2.0177 3.1253 4.0378 1.8484 3.1293 2.2536 1.7228 1.9730 1.9869 3.5168 1.1070 2.6326 5.2473 4.0768 1.2223 1.2136 1.2656 2.3940 1.4553 3.4952 1.5273 10.3721 1.2300 1.2282 2.9752 2.9140 1.1638 1.0781 1.0651 1.0497 1.0465 1.0476 7.4918 7.2162 9.1684 11.5004 12.5654 1.0360 1.0361 1.0601 1.0602 1.0860 1.0969 1.0994 1.1006 1.1033 1.1004 1.1001 1.0941 1.0929 1.0939
irintensity: 0.1395 0.0771 0.4045 0.2096 0.0024 0.4939 5.8792 8.6829 2.0010 0.0496 0.5852 0.6479 0.1965 0.3769 0.2784 0.8610 0.5167 4.2483 3.8279 2.0906 5.8272 12.8014 15.4671 7.6118 7.1567 0.8261 0.7531 5.7807 0.0591 0.1065 1.8729 32.4543 14.4665 26.0997 5.8118 2.5000 14.5907 70.7737 80.6995 18.9405 4.4625 34.5714 15.9465 0.2758 14.0218 3.5994 65.5822 22.7730 2.5684 18.0148 30.6020 1.3282 82.6916 22.4753 5.1351 36.8760 19.8233 65.8737 1.7780 9.5399 224.7605 622.5602 37.9970 2.1397 8.8920 29.5259 5.9319 338.8443 67.0262 1.3395 26.2772 30.7323 74.4845 146.8764 13.1357 3.9687 21.1703 6.1962 17.2011 14.0213 95.0539 158.5002 91.2835 575.5459 26.1883 31.3953 13.2143 41.9418 5.9260 2.4806 2.0438 42.3540 36.2345 0.4653 31.2470 36.3041 2.1425 6.6072 2.6696
temp: 298.150 k
press: 1.00000 atm
elementType: 17 17 8 8 8 7 7 6 6 6 6 6 6 6 6 6 6 6 6 6 6 1 1 1 1 1 1 1 1 1 1 1 1 1 1
symmnumber: 1
zpe: 677364.6 jmol-1
zpe.correction: 0.257995 hartree
zpe.thermalcorrener: 0.278749 hartree
zpe.thermalcorrenthalpy: 0.279693 hartree
zpe.thermalcorrgfe: 0.206294 hartree
zpe.sumelectzpe: -1795.692532 hartree
zpe.sumelectthermal: -1795.671777 hartree
zpe.sumelectthermalent: -1795.670833 hartree
zpe.sumelectthermalfe: -1795.744232 hartree
dipole: 1.8179 1.0050 0.1804
dipole: 2.0851
quadrupole: -142.5298 -145.7624 -137.0584
quadrupole: 2.8593 0.3836 -4.6852
quadrupole: -0.7462 -3.9789 4.7251 2.8593 0.3836 -4.6852
hfenergy: -1795.9505264 hartree
pointgroup: C01 [X(C14H14Cl2N2O3)]
dipole: 0.7166741 -0.3985664 -0.0212507 debye
polarizability: 266.7601683|1.9816154|212.7744743|12.5106718|-13.5153343|115.5446089 unknown
InChI: InChI=1S/C14H14Cl2N2O3/c1-3-8(2)13(20)17-7-12(19)18(14(17)21)11-5-9(15)4-10(16)6-11/h4-6,8H,3,7H2,1-2H3
charge 0 multiplicity 1
35 atoms
Cl -3.861337 -3.362193 0.696787
Cl -5.437534 1.609254 -1.197105
O  3.987957 1.324057 0.453366
O  0.696825 -1.39284 -0.272229
O  -0.941294 2.914176 0.772093
N  1.798582 0.66313 0.281278
N  -0.487426 0.632372 0.213849
C  3.647695 -1.054371 -0.106352
C  1.37304 2.035024 0.622843
C  3.199704 0.371892 0.208806
C  5.060133 -1.051591 -0.741655
C  0.691328 -0.182546 0.038197
C  -0.14838 1.972732 0.559103
C  3.615848 -1.8778 1.21691
C  -1.828367 0.134507 0.056212
C  5.105987 -0.401829 -2.141369
C  -2.833909 1.003842 -0.437075
C  -2.134177 -1.204026 0.409353
C  -3.45794 -1.646753 0.249363
C  -4.140506 0.503451 -0.566176
C  -4.489642 -0.819642 -0.234341
H  2.924017 -1.514461 -0.802845
H  1.775112 2.773295 -0.092034
H  1.716373 2.330043 1.629282
H  5.760941 -0.527998 -0.064964
H  5.395799 -2.105073 -0.808368
H  3.952964 -2.908805 1.010964
H  4.293479 -1.435387 1.969501
H  2.597944 -1.936617 1.639507
H  4.409646 -0.902866 -2.840402
H  4.837212 0.66865 -2.090217
H  6.121158 -0.468135 -2.572591
H  -2.607636 2.03934 -0.693011
H  -1.362344 -1.881134 0.77605
H  -5.512053 -1.186798 -0.346131
