program: Gaussian 09
title: 000014053
version: EM64L-G09RevD.01
frameworkgroup: C1[X(C10H18Cl2O2)]
method: RPBEPBE
basis: SDD
operation: Freq
keyword: #p
keyword: freq=noraman
keyword: PBEPBE/SDD
title: #p freq=noraman PBEPBE/SDD
converged: YES YES NO NO
title: Mulliken charges:
elementType: Cl Cl O O C C C C C C C C C C H H H H H H H H H H H H H H H H H H
charge: -0.106109 -0.081388 -0.265420 -0.241820 -0.349418 -0.354524 -0.310686 -0.375383 -0.342430 -0.519567 -0.586547 0.237577 -0.226579 -0.672295 0.227857 0.199237 0.220301 0.190595 0.283020 0.215875 0.217993 0.236785 0.231858 0.250327 0.244707 0.282466 0.268070 0.227326 0.227110 0.211325 0.230059 0.229677
chargesum: 0.00000
title: Mulliken charges with hydrogens summed into heavy atoms:
elementType: Cl Cl O O C C C C C C C C C C
charge: -0.106109 -0.081388 -0.265420 -0.241820 0.077677 0.056372 -0.027666 0.058485 0.126214 -0.024533 -0.036011 0.237577 0.227857 -0.001234
polarizability: 1.65522043e+02 -2.64012149e+00 1.17767180e+02 1.62540688e+00 -2.40408286e+00 1.14483145e+02
1716.lowfreq: -8.6180 -4.4500 -2.2368 -0.0015 -0.0010 0.0017 9.1926 19.4102 37.4619
frequency: 4.4213 19.1384 37.4451 45.5334 51.6813 56.1997 78.9651 91.6373 119.2636 135.4292 153.4164 177.1348 193.3480 223.8573 248.2050 289.0284 319.3577 354.4280 363.1905 438.0566 442.6138 518.4424 545.8405 553.3190 604.7587 680.5974 726.7575 776.3829 799.0024 812.5476 831.4623 890.5684 907.6034 942.3554 990.0296 1009.6934 1025.1515 1055.1695 1058.2291 1088.4902 1098.1591 1110.2464 1114.6371 1125.8590 1133.4175 1136.4421 1143.7346 1184.9348 1224.4575 1238.3029 1248.6393 1265.3573 1278.9454 1288.7208 1290.5220 1313.6742 1320.7415 1351.8048 1362.9421 1368.9230 1372.0877 1400.6245 1424.1011 1440.7256 1446.4506 1446.4881 1463.2963 1466.0339 1474.3100 1482.5269 1487.2915 1639.2343 2955.6677 2967.9331 2980.2691 2985.2908 2993.7461 2995.7153 3008.7548 3014.0122 3026.9938 3035.5836 3040.3649 3062.8623 3063.9683 3066.9726 3070.9207 3092.3483 3107.0927 3148.0098
redmass: 5.8687 5.7875 4.2034 5.8293 2.9099 2.3829 2.9975 4.1158 3.4708 2.9604 1.9603 3.7353 3.3313 3.9089 1.3005 4.5278 3.1070 3.3087 3.3842 3.4773 3.4753 2.6880 3.2561 3.1471 4.8655 5.7655 1.1183 1.3385 1.0977 3.5765 1.6327 1.5530 6.0987 1.8507 2.3979 2.6618 2.3507 2.6613 2.1057 2.5627 2.1981 2.0333 2.1582 1.2130 2.6985 1.4803 1.3612 1.3100 1.3422 1.3147 1.1362 1.2324 1.2584 1.1012 1.1357 1.1567 1.3430 1.3731 1.5270 1.7642 1.6784 1.2682 1.0841 1.0854 1.0844 1.0896 1.0402 1.0754 1.0577 1.0971 1.0711 9.6802 1.0623 1.0625 1.0597 1.0620 1.0603 1.0359 1.0581 1.0922 1.0982 1.0969 1.0998 1.0988 1.0625 1.1066 1.0891 1.0986 1.1025 1.1114
irintensity: 1.8369 0.2942 1.8347 0.6261 1.5665 0.0159 1.3107 1.5514 1.7613 0.3585 6.2438 2.0834 8.9402 0.1942 1.6650 11.7562 1.8305 13.1484 4.9594 2.4176 1.9380 2.2160 11.4887 14.5238 19.2528 3.3719 11.8494 5.7416 3.6412 3.0874 26.3437 10.6279 20.2387 25.4034 1.7289 4.6147 70.7247 5.4969 42.3319 14.8743 3.1834 51.0032 8.7390 15.1790 228.5227 12.1082 15.2429 43.0682 14.1631 52.4795 0.0150 12.9161 18.0828 3.9220 12.1293 10.5166 26.6001 5.0943 5.6827 4.2776 15.8452 18.1088 7.0084 31.1219 3.9284 13.0861 11.9524 0.1373 5.2110 17.8916 14.7488 168.6736 15.0558 17.6499 16.8926 3.1033 33.6351 24.1584 20.8376 6.6907 2.4583 5.5094 4.8960 46.0571 18.7212 11.4951 37.0658 30.8478 45.7405 6.8495
temp: 298.150 k
press: 1.00000 atm
elementType: 17 17 8 8 6 6 6 6 6 6 6 6 6 6 1 1 1 1 1 1 1 1 1 1 1 1 1 1 1 1 1 1
symmnumber: 1
zpe: 696339.6 jmol-1
zpe.correction: 0.265222 hartree
zpe.thermalcorrener: 0.283054 hartree
zpe.thermalcorrenthalpy: 0.283998 hartree
zpe.thermalcorrgfe: 0.213170 hartree
zpe.sumelectzpe: -1461.311222 hartree
zpe.sumelectthermal: -1461.293390 hartree
zpe.sumelectthermalent: -1461.292445 hartree
zpe.sumelectthermalfe: -1461.363273 hartree
dipole: -1.5632 -0.2378 0.9100
dipole: 1.8244
quadrupole: -90.0830 -105.2898 -102.1879
quadrupole: -3.3663 17.2047 2.3100
quadrupole: 9.1039 -6.1029 -3.0010 -3.3663 17.2047 2.3100
hfenergy: -1461.5764438 hartree
pointgroup: C01 [X(C10H18Cl2O2)]
dipole: -0.6064279 0.3433979 -0.1717663 debye
polarizability: 165.5661724|2.0917344|118.1618452|1.8075485|2.006406|114.0443508 unknown
InChI: InChI=1S/C10H18Cl2O2/c1-2-14-10(13)6-4-3-5-9(12)7-8-11/h9H,2-8H2,1H3
charge 0 multiplicity 1
32 atoms
Cl 3.393597 -1.467577 -1.470079
Cl 5.973704 -0.336385 1.76837
O  -4.281388 -0.485252 0.173598
O  -3.326596 1.6305 -0.031991
C  1.896484 0.615602 -0.291369
C  0.667827 -0.277794 -0.020918
C  3.248894 -0.086039 -0.13157
C  -0.656184 0.50652 -0.143285
C  4.454824 0.848182 -0.295472
C  -1.884506 -0.381827 0.129647
C  5.815767 0.201721 -0.045621
C  -3.194601 0.389079 0.075473
C  -5.638215 0.146283 0.158444
C  -6.651326 -0.984502 0.30275
H  1.830572 1.056954 -1.305418
H  1.889614 1.46601 0.424975
H  0.673971 -1.126217 -0.732436
H  0.750354 -0.715485 0.995865
H  3.312236 -0.655537 0.811114
H  -0.739507 0.945644 -1.156283
H  -0.662114 1.360783 0.560681
H  4.454371 1.261302 -1.324617
H  4.322978 1.703428 0.396957
H  -1.943749 -1.220414 -0.590115
H  -1.811089 -0.853157 1.130422
H  5.956399 -0.716208 -0.634377
H  6.645192 0.906165 -0.203806
H  -5.752204 0.700519 -0.790827
H  -5.691971 0.87406 0.988452
H  -7.67669 -0.571693 0.298878
H  -6.562712 -1.702479 -0.530456
H  -6.500031 -1.530585 1.249514
