program: Gaussian 09
title: 000155440
version: EM64L-G09RevD.01
frameworkgroup: C1[X(C14H14Cl2N2O4)]
method: RPBEPBE
basis: SDD
operation: Freq
keyword: #p
keyword: freq=noraman
keyword: PBEPBE/SDD
title: #p freq=noraman PBEPBE/SDD
converged: YES YES NO NO
title: Mulliken charges:
elementType: Cl Cl O O O O N N C C C C C C C C C C C C C C H H H H H H H H H H H H H H
charge: -0.037472 -0.034708 -0.257887 -0.177467 -0.214927 -0.188608 -0.232323 -0.360812 -0.468426 0.175881 0.277844 0.211371 0.521383 -0.320030 0.044788 -0.320577 -0.318427 -0.694102 -0.688589 -0.073623 -0.077070 -0.251268 0.296312 0.297276 0.245162 0.227741 0.181780 0.307431 0.304029 0.217920 0.228497 0.228291 0.199243 0.238367 0.225637 0.287364
chargesum: 0.00000
title: Mulliken charges with hydrogens summed into heavy atoms:
elementType: Cl Cl O O O O N N C C C C C C C C C C C C C C
charge: -0.037472 -0.034708 -0.257887 -0.177467 -0.214927 -0.188608 -0.232323 -0.360812 0.125162 0.175881 0.277844 0.211371 0.521383 0.152874 0.226568 -0.013146 -0.014399 -0.019395 -0.025343 -0.073623 -0.077070 0.036097
polarizability: 2.80678531e+02 -2.83659818e+00 2.23251869e+02 -1.59435331e+01 -6.60778175e+00 1.11651527e+02
1716.lowfreq: -1.3332 -0.0019 -0.0018 0.0010 3.4928 5.7549 13.8849 20.7506 35.6892
frequency: 13.8485 20.7123 35.6565 40.4957 47.3483 72.8351 92.4379 113.0501 125.8784 146.1962 158.6635 162.7309 185.6414 187.3862 198.0917 221.1113 240.6375 250.7714 255.3915 273.5006 291.7867 303.7912 359.8255 383.8171 387.5466 412.8653 432.5090 447.4765 481.3041 496.9596 511.0301 539.5598 556.9999 588.4938 600.5033 660.9429 668.2355 695.0107 715.8347 748.7473 759.5482 809.0048 861.4697 870.1739 872.5986 879.9705 897.2664 920.5872 937.6246 975.4874 981.3487 986.8659 991.8914 1006.7806 1067.5293 1092.4679 1111.5806 1116.3351 1116.8984 1147.7271 1165.5896 1168.6647 1180.0044 1208.8579 1212.0455 1226.8625 1268.1442 1315.4699 1325.2814 1328.6869 1343.5454 1373.8394 1375.7145 1389.4688 1395.7104 1421.8212 1427.8558 1445.9991 1454.3717 1455.6412 1466.4426 1474.7756 1487.2751 1567.8164 1599.2772 1638.3043 1653.1183 1702.6357 2923.4499 2928.5020 2976.8385 2983.9409 2994.8527 3030.2004 3077.4163 3085.5636 3087.1041 3096.0150 3103.8238 3189.6510 3208.1375 3209.8362
redmass: 8.5290 2.7788 6.5021 5.6881 10.2766 5.4524 5.8588 5.6413 8.1745 8.3913 2.9563 7.7108 3.9219 1.1030 4.6216 5.0959 1.2055 3.2093 6.2103 9.2200 5.3805 6.6841 4.7145 10.8384 3.6405 8.5043 3.1840 5.0424 3.7766 4.6467 5.1348 3.7519 3.2858 4.4446 9.0130 2.6481 6.1398 4.4863 9.7534 6.7220 10.4121 4.0767 1.6289 2.2255 1.3974 2.3377 2.8389 1.2012 1.4039 7.0770 2.0054 5.5218 2.0650 4.6206 5.0215 2.6930 2.1209 1.8964 2.0580 2.0194 5.1380 1.1065 1.9670 4.3374 1.1088 4.3143 1.2120 1.5340 1.8878 1.5422 3.1591 1.3156 10.3344 1.4354 1.2214 2.9237 1.0977 2.9829 1.1516 1.0481 1.0515 1.0522 1.0497 7.4736 7.1422 10.1149 11.6315 12.5928 1.0840 1.0596 1.0923 1.0396 1.0357 1.0598 1.0990 1.1036 1.1007 1.0995 1.1002 1.0939 1.0930 1.0938
irintensity: 0.1447 0.8452 0.2460 0.5441 0.2471 0.4233 0.4119 9.5010 4.1420 1.8493 6.2330 0.1129 5.8149 0.8689 0.1537 0.4259 0.9823 3.3177 1.5429 8.8173 3.0070 1.3120 6.2846 14.6736 1.5334 8.6028 4.0997 1.4572 0.6733 3.1989 0.0564 0.5985 5.1416 1.4107 37.7983 23.9301 21.2146 53.1158 7.4087 19.6337 83.6272 24.7506 49.0192 1.1428 0.5853 17.2272 8.0921 2.5968 0.3241 52.6118 3.3359 33.4499 3.9853 126.3156 13.0991 120.0036 75.0037 52.0954 48.6917 15.7593 76.2454 1.0619 43.0550 278.5541 4.9475 614.7528 0.3966 25.6131 5.7881 9.7240 334.3982 34.4634 1.7063 62.0153 20.3722 74.4233 30.2773 144.1474 17.1784 6.3180 1.4108 5.4837 16.5062 92.7593 135.6534 125.8478 611.5644 29.5376 52.5995 58.0382 14.6874 22.7193 19.6604 5.7184 40.7091 0.3567 9.6483 50.2871 28.9286 2.2541 7.0145 3.4222
temp: 298.150 k
press: 1.00000 atm
elementType: 17 17 8 8 8 8 7 7 6 6 6 6 6 6 6 6 6 6 6 6 6 6 1 1 1 1 1 1 1 1 1 1 1 1 1 1
symmnumber: 1
zpe: 684846.1 jmol-1
zpe.correction: 0.260844 hartree
zpe.thermalcorrener: 0.282849 hartree
zpe.thermalcorrenthalpy: 0.283793 hartree
zpe.thermalcorrgfe: 0.206307 hartree
zpe.sumelectzpe: -1870.811895 hartree
zpe.sumelectthermal: -1870.789891 hartree
zpe.sumelectthermalent: -1870.788947 hartree
zpe.sumelectthermalfe: -1870.866433 hartree
dipole: 1.2225 1.9929 0.1484
dipole: 2.3427
quadrupole: -151.4574 -150.4386 -140.5954
quadrupole: 10.3653 -0.2056 -2.4796
quadrupole: -3.9603 -2.9414 6.9017 10.3653 -0.2056 -2.4796
hfenergy: -1871.0727395 hartree
pointgroup: C01 [X(C14H14Cl2N2O4)]
dipole: 0.4820975 -0.7852846 -0.0211233 debye
polarizability: 280.6136395|3.6736933|222.4093868|16.1003042|-11.7222289|112.5589016 unknown
InChI: InChI=1S/C14H14Cl2N2O4/c1-8(2)22-7-13(20)17-6-12(19)18(14(17)21)11-4-9(15)3-10(16)5-11/h3-5,8H,6-7H2,1-2H3
charge 0 multiplicity 1
36 atoms
Cl -3.685943 -3.660418 0.966493
Cl -6.082254 0.847507 -1.210499
O  4.672011 -0.155711 -0.201475
O  -1.837365 3.016117 0.519811
O  0.487696 -1.04655 -0.160865
O  3.314315 2.155006 0.298644
N  1.22182 1.19763 0.183688
N  -1.025763 0.792953 0.158274
C  0.588243 2.509792 0.410247
C  -0.904685 2.19816 0.377667
C  0.268398 0.169207 0.037928
C  2.652376 1.106527 0.13126
C  -2.268971 0.073603 0.064173
C  3.233944 -0.280866 -0.137911
C  5.387107 -1.457962 -0.112058
C  -3.409071 0.730256 -0.464359
C  -2.345706 -1.270127 0.509588
C  5.12735 -2.340329 -1.348527
C  6.862549 -1.080906 0.052761
C  -3.57895 -1.934756 0.40379
C  -4.615545 0.013687 -0.53496
C  -4.737895 -1.323755 -0.111855
H  0.863905 3.234628 -0.37493
H  0.882312 2.943746 1.381395
H  2.794801 -0.678783 -1.077643
H  2.905627 -0.974806 0.669088
H  5.026526 -1.984937 0.801755
H  -3.360643 1.76931 -0.790725
H  -1.469606 -1.785057 0.904066
H  5.717086 -3.27275 -1.278435
H  4.06394 -2.626151 -1.44085
H  5.429846 -1.80652 -2.267279
H  7.482483 -1.986035 0.182594
H  6.995523 -0.42815 0.931738
H  7.216645 -0.534177 -0.838889
H  -5.686204 -1.861285 -0.179802
