program: Gaussian 09
title: 000155427
version: EM64L-G09RevD.01
frameworkgroup: C1[X(C8H3Cl5)]
method: RPBEPBE
basis: SDD
operation: Freq
keyword: #pfreq=noraman
keyword: PBEPBE/SDD
title: #p freq=noraman PBEPBE/SDD
converged: YES YES NO NO
title: Mulliken charges:
elementType: Cl Cl Cl Cl Cl C C C C C C C C H H H
charge: 0.031631 -0.000741 0.007978 0.083295 0.049304 0.537228 -0.255854 -0.336586 -0.069636 -0.203425 -0.222659 -0.027619 -0.365821 0.261888 0.245342 0.265675
chargesum: 0.00000
title: Mulliken charges with hydrogens summed into heavy atoms:
elementType: Cl Cl Cl Cl Cl C C C C C C C C
charge: 0.031631 -0.000741 0.007978 0.083295 0.049304 0.537228 -0.255854 -0.074698 -0.069636 0.041917 0.043016 -0.027619 -0.365821
polarizability: 1.73570443e+02 1.04818868e+01 1.26070313e+02 -3.23910316e+00 7.59503053e+00 9.84179218e+01
1716.lowfreq: -2.1806 -0.0019 -0.0015 -0.0012 4.3292 6.7668 19.7415 49.2200 59.5964
frequency: 19.6807 49.2187 59.5934 103.3217 111.6243 165.6013 192.6500 207.7922 224.4043 260.1484 297.3442 319.6202 357.9636 376.0379 433.3618 453.1151 505.6506 544.0214 584.2200 626.1863 701.4350 719.1870 744.2937 793.3478 841.6553 910.5244 927.6546 978.1900 1027.6792 1094.2662 1150.7331 1191.2867 1248.3757 1354.5032 1400.1735 1433.0165 1558.7298 1585.2637 1644.4981 3151.8970 3166.7904 3181.6565
redmass: 15.2128 21.4290 23.6407 12.3994 21.5773 14.9387 30.2181 5.2677 15.7645 12.5020 12.4592 9.7256 24.5231 10.5953 9.6896 12.0541 3.8764 6.3509 8.5857 9.5081 5.9473 6.3384 3.5433 1.7683 8.5707 1.6674 4.3484 1.3477 6.0430 2.0575 1.7962 1.4047 2.4411 10.9254 2.9978 2.4678 6.5050 7.3740 11.8229 1.0871 1.0930 1.0998
irintensity: 0.3432 0.0584 0.0777 0.3797 0.1589 2.4446 0.0110 0.5565 0.3185 1.2314 0.4678 1.7876 0.2273 1.6791 3.7394 10.3261 0.3401 5.6356 5.9408 49.5664 7.9410 31.9453 139.2343 13.6347 89.5772 1.6578 15.6738 0.5445 28.1544 7.5429 23.5752 16.2966 32.6179 0.0105 55.3951 8.5176 14.8605 3.8564 15.8170 2.2707 2.4008 6.0068
temp: 298.150 k
press: 1.00000 atm
elementType: 17 17 17 17 17 6 6 6 6 6 6 6 6 1 1 1
symmnumber: 1
zpe: 219495.1 jmol-1
zpe.correction: 0.083601 hartree
zpe.thermalcorrener: 0.096678 hartree
zpe.thermalcorrenthalpy: 0.097622 hartree
zpe.thermalcorrgfe: 0.040833 hartree
zpe.sumelectzpe: -2605.985548 hartree
zpe.sumelectthermal: -2605.972471 hartree
zpe.sumelectthermalent: -2605.971527 hartree
zpe.sumelectthermalfe: -2606.028316 hartree
dipole: 0.9491 2.8871 1.3947
dipole: 3.3439
quadrupole: -107.7456 -103.1719 -108.6594
quadrupole: 5.4485 2.4084 4.6580
quadrupole: -1.2199 3.3537 -2.1338 5.4485 2.4084 4.6580
hfenergy: -2606.0691492 hartree
pointgroup: C01 [X(C8H3Cl5)]
dipole: -0.5129584 1.2016105 0.1542377 debye
dipolederiv: -0.0965972 0.1629483 0.0116612 0.1350997 -0.5857964 -0.0328331 0.0160652 -0.0416341 -0.0104792 -0.478338 -0.3099175 0.0251972 -0.3760935 -0.3439127 0.0245557 0.0413147 0.0257046 -0.0305336 -0.2857067 0.0349381 0.1512042 0.0704351 -0.025594 -0.0944978 0.2392847 -0.0731369 -0.6453239 -0.8272186 0.1021316 0.0678722 0.1400619 0.0235764 -0.0253056 0.1320404 -0.035507 -0.1207693 -0.2092396 0.0437448 0.1248775 0.057321 0.0101853 -0.0989976 0.0485391 -0.0910555 -0.6769739 -0.0015006 0.060897 0.0987226 0.1160703 -0.0888748 -0.0463707 -0.0625929 -0.0159121 -0.1145941 -0.0415838 -0.3731904 -0.0383891 -0.2892692 0.7796122 0.0563711 -0.0145537 0.0756789 -0.0215852 -0.0759105 0.0533139 -0.0437301 -0.0569658 0.0104634 0.0142089 -0.0030126 0.0009986 -0.1053757 0.5920156 0.5640515 -0.051992 0.7314762 0.3126794 -0.0749948 -0.0512648 -0.0542224 -0.0256498 -0.0373458 -0.0645 -0.0136533 -0.0447549 0.0756143 0.0353242 -0.0053075 0.0225328 -0.1199177 -0.089874 -0.060728 -0.0101613 -0.1614306 -0.0897655 0.0179983 -0.0081406 0.0074342 -0.0914813 0.3598163 -0.0268105 -0.2164563 -0.0879133 -0.0417835 0.1437543 -0.259771 0.0690099 0.6974538 1.1414452 -0.1756288 -0.1551431 -0.2254301 -0.080313 0.1061566 -0.1224095 0.135451 0.8131188 0.0251481 -0.0762906 0.0175232 -0.0743028 0.0241635 -0.0044443 0.0094571 0.0007732 0.134036 0.046156 0.039147 0.0092199 0.0481122 -0.0678958 -0.0147562 0.0176685 -0.0180142 0.1597486 -0.0212663 0.0258936 0.0232471 0.0175838 0.0876411 -0.006169 0.022683 -0.0081011 0.1583265 unknown
polarizability: 174.8211953|-1.5763765|123.7912928|-8.156422|8.6110046|99.4461896 unknown
InChI: InChI=1S/C8H3Cl5/c9-5-3-1-2-4(6(5)10)7(11)8(12)13/h1-3H
charge 0 multiplicity 1
16 atoms
Cl -0.415821 -2.385889 -0.291372
Cl -3.560496 -1.629398 0.146249
Cl 1.913226 -0.226248 -2.213696
Cl 4.173319 -0.286376 0.156401
Cl 2.046265 0.279988 2.224882
C  0.037404 0.366536 -0.226959
C  -0.937674 -0.664416 -0.151351
C  -0.379162 1.717139 -0.107108
C  -2.297544 -0.337898 0.042383
C  -1.738743 2.034804 0.087851
C  -2.703548 1.007295 0.160996
C  1.471131 0.061553 -0.464544
C  2.441572 0.026501 0.481864
H  0.37433 2.507944 -0.170122
H  -2.052699 3.078684 0.180764
H  -3.762459 1.237583 0.309462
