program: Gaussian 09
title: 000155422
version: EM64L-G09RevD.01
frameworkgroup: C1[X(C6H6INO)]
method: RPBEPBE
basis: SDD
operation: Freq
keyword: #p
keyword: freq=noraman
keyword: PBEPBE/SDD
title: #p freq=noraman PBEPBE/SDD
converged: YES YES NO NO
title: Mulliken charges:
elementType: I O N C C C C C C H H H H H H
charge: 0.084823 -0.413718 -0.369995 0.421853 -0.391034 -0.347055 -0.135224 -0.133877 -0.367357 0.231532 0.260550 0.247132 0.246125 0.295919 0.370325
chargesum: 0.00000
title: Mulliken charges with hydrogens summed into heavy atoms:
elementType: I O N C C C C C C
charge: 0.084823 -0.043393 -0.074077 0.421853 -0.159502 -0.086505 0.111908 0.112249 -0.367357
polarizability: 1.71787999e+02 -7.13114891e-01 8.56460273e+01 -2.99852837e+00 -1.73351696e+00 3.63229598e+01
1716.lowfreq: -7.1046 0.0002 0.0004 0.0005 5.2776 9.8192 67.8530 108.2822 150.3284
frequency: 67.8494 108.2714 150.3271 212.3693 257.2094 290.1412 360.8777 404.7986 458.9631 498.3294 572.5222 622.3856 667.4012 694.3636 803.2434 823.7449 836.3892 936.8004 957.2414 966.9175 983.5823 1052.9402 1113.5718 1182.4109 1245.4249 1288.7771 1315.0747 1347.8658 1398.1514 1441.2260 1468.8026 1581.2640 1603.2732 3127.2171 3158.0075 3167.9236 3184.1522 3446.0430 3522.3520
redmass: 6.2364 4.3798 6.6710 10.7546 5.4577 3.5659 1.3721 2.9290 3.6915 2.7444 3.7604 7.0619 2.6656 3.4000 1.4814 1.4258 2.9277 1.3437 1.4233 3.4424 4.6875 2.4111 1.3388 1.1116 2.0215 1.2680 1.4545 2.8436 4.3264 1.3858 2.4762 6.0576 6.1508 1.0893 1.0894 1.0953 1.0954 1.0769 1.0685
irintensity: 0.2315 2.7579 0.6059 0.4595 5.3892 1.1127 87.2370 2.0381 7.3152 63.6622 168.4486 3.7468 118.1652 4.5422 28.0493 41.8578 106.4859 0.9002 3.9849 43.2941 36.1320 14.1679 4.2341 10.5930 6.8827 0.8887 115.0277 5.7208 0.1247 28.3908 124.5971 0.3423 24.4095 11.3275 3.1545 7.6267 2.9748 5.4170 30.6763
temp: 298.150 k
press: 1.00000 atm
elementType: 53 8 7 6 6 6 6 6 6 1 1 1 1 1 1
symmnumber: 1
zpe: 283025.7 jmol-1
zpe.correction: 0.107799 hartree
zpe.thermalcorrener: 0.116475 hartree
zpe.thermalcorrenthalpy: 0.117419 hartree
zpe.thermalcorrgfe: 0.072305 hartree
zpe.sumelectzpe: -373.003148 hartree
zpe.sumelectthermal: -372.994472 hartree
zpe.sumelectthermalent: -372.993528 hartree
zpe.sumelectthermalfe: -373.038642 hartree
dipole: -3.0574 0.7129 0.6203
dipole: 3.2001
quadrupole: -54.0337 -58.9538 -72.0025
quadrupole: -1.9736 -4.2730 -3.2569
quadrupole: 7.6296 2.7096 -10.3392 -1.9736 -4.2730 -3.2569
hfenergy: -373.1109469 hartree
pointgroup: C01 [X(C6H6I1N1O1)]
dipole: -1.1734293 0.3574509 0.2836419 debye
dipolederiv: -0.523516 0.0618335 0.0232541 0.0673596 -0.0465657 -0.0025507 0.0242965 -0.0022422 -0.0159614 -0.7457298 0.0054372 -0.0686932 -0.2237764 -0.3595131 0.0529075 -0.4030204 -0.0063067 0.0003663 -0.8039841 0.2432773 0.179989 0.5694226 0.0768651 -0.1408179 0.8548125 -0.1620779 -0.3200977 1.3039883 -0.148556 -0.1398819 -0.3334979 -0.0394058 0.0088559 -0.2065775 0.012192 0.0882997 -0.3700157 0.0444451 0.0061646 -0.1346134 0.0622824 0.02082 -0.0301898 0.0060023 -0.1971115 -0.2733174 0.0099213 0.0195046 0.243961 -0.0257285 -0.0220611 0.0265164 0.0161078 -0.1941205 -0.2023539 0.0475189 -0.0016024 -0.0502189 0.1138645 -0.0029846 0.0224199 0.0037249 -0.0770939 -0.1918295 0.0276537 -0.0048888 0.121044 0.1156197 -0.0045588 -0.0034168 0.0005809 -0.0746885 1.0502821 -0.170502 -0.0515352 -0.169559 -0.1750064 0.0077576 -0.0618969 0.0027916 -0.1941226 0.0002697 0.0971859 0.0065879 0.0791981 -0.0628141 0.0024958 0.0027619 -0.000209 0.1686544 0.0187103 -0.0699726 0.0129293 -0.0508123 0.0103458 0.0041153 0.0178167 -0.0015541 0.1734858 0.0405359 -0.0905175 0.0061953 -0.0787906 0.000073 0.0075511 0.0072008 0.0054976 0.1590477 0.0809456 0.0634405 0.0022515 0.0593249 -0.0395535 -0.0011803 0.0016688 -0.0014272 0.1567187 0.1942998 -0.0893008 -0.0433138 -0.0936436 0.0914112 0.0729408 -0.2746042 0.1237204 0.2451283 0.4217147 -0.0318646 0.053039 -0.0053981 0.2781253 -0.0032906 0.0222123 0.0031994 0.0814951 unknown
polarizability: 170.9884976|-6.3950086|86.1366572|-7.3703751|-0.9506125|36.6318312 unknown
InChI: InChI=1S/C6H6INO/c7-5-1-3-6(8-9)4-2-5/h1-4,8-9H
charge 0 multiplicity 1
15 atoms
I  3.84805 -0.381819 -0.119281
O  -3.323392 -0.593472 -0.13991
N  -2.476348 0.541264 0.261736
C  -1.08099 0.302782 0.106835
C  -0.205012 1.420831 0.041142
C  -0.543873 -1.008725 0.098024
C  1.190259 1.228239 -0.01914
C  0.853521 -1.200369 0.033803
C  1.715344 -0.083968 -0.020116
H  -0.606239 2.441416 0.04749
H  -1.217371 -1.86901 0.114213
H  1.854701 2.095806 -0.067193
H  1.257343 -2.216833 0.020853
H  -2.828537 1.371199 -0.235223
H  -3.761156 -0.86394 0.710568
