program: Gaussian 09
title: 000155418
version: EM64L-G09RevD.01
frameworkgroup: C1[X(C4H2Cl4O)]
method: RPBEPBE
basis: SDD
operation: Freq
keyword: #p
keyword: freq=noraman
keyword: PBEPBE/SDD
title: #p freq=noraman PBEPBE/SDD
converged: NO YES YES YES
title: Mulliken charges:
elementType: Cl Cl Cl Cl O C C C C H H
charge: 0.051988 0.052016 0.076993 0.088721 -0.144037 0.782867 -0.739798 -0.571872 -0.136357 0.344865 0.194613
chargesum: 0.00000
title: Mulliken charges with hydrogens summed into heavy atoms:
elementType: Cl Cl Cl Cl O C C C C
charge: 0.051988 0.052016 0.076993 0.088721 -0.144037 0.782867 -0.394932 -0.571872 0.058256
polarizability: 1.15284540e+02 -8.58812088e+00 8.53207106e+01 -1.09798928e-03 6.32717745e-04 6.13249093e+01
1716.lowfreq: -10.6602 -9.7514 -6.2056 0.0013 0.0021 0.0034 45.1602 59.8265 127.8758
frequency: 45.0470 59.8036 127.8702 144.6772 165.2513 175.4992 211.1097 276.3284 324.6743 369.6997 373.5071 418.5068 544.8654 634.4095 696.9923 765.3821 819.5577 889.5944 967.1052 1210.9846 1219.4970 1270.0855 1401.1752 1565.8915 1614.2833 2958.0004 3156.4477
redmass: 16.7741 26.3471 9.0780 19.7223 17.7631 3.0618 18.5567 24.2444 19.5971 8.9845 12.1573 10.4674 8.6432 10.3754 7.5986 8.0349 9.3685 5.3494 1.8432 1.0607 4.9035 1.3257 1.1983 8.4421 8.8438 1.0871 1.0884
irintensity: 1.0795 0.0125 4.2949 0.8271 1.2615 5.4351 4.3537 0.3822 1.4741 0.1393 18.7812 21.9463 30.5647 73.1415 127.6804 71.8197 68.3661 38.7048 0.3140 11.2087 134.5083 39.3840 19.3267 265.9330 103.4220 47.0469 0.9555
temp: 298.150 k
press: 1.00000 atm
elementType: 17 17 17 17 8 6 6 6 6 1 1
symmnumber: 1
zpe: 134019.1 jmol-1
zpe.correction: 0.051045 hartree
zpe.thermalcorrener: 0.061209 hartree
zpe.thermalcorrenthalpy: 0.062154 hartree
zpe.thermalcorrgfe: 0.013026 hartree
zpe.sumelectzpe: -2068.357786 hartree
zpe.sumelectthermal: -2068.347622 hartree
zpe.sumelectthermalent: -2068.346678 hartree
zpe.sumelectthermalfe: -2068.395805 hartree
dipole: 3.6309 -1.3616 -0.0005
dipole: 3.8778
quadrupole: -84.3254 -78.9846 -79.8893
quadrupole: 5.6792 0.0014 0.0013
quadrupole: -3.2589 2.0818 1.1772 5.6792 0.0014 0.0013
hfenergy: -2068.4088315 hartree
pointgroup: C01 [X(C4H2Cl4O1)]
dipole: 1.4844485 0.3520729 0.0000249 debye
dipolederiv: -0.3427118 0.0972761 -0.2614667 0.1018514 -0.1041051 0.0124759 -0.2206195 0.0579321 -0.576454 -0.3427735 0.0973101 0.2615145 0.1018562 -0.1040529 -0.012507 0.2205972 -0.057935 -0.5762771 -0.279498 -0.235657 0.0000406 -0.3424467 -0.7826027 0.0001363 0.0000489 0.0001312 0.0434836 -0.510817 0.3044619 -0.0000671 0.4389488 -0.4286347 0.0000982 -0.0000989 0.000095 0.075674 -0.7735616 -0.377999 0.0000872 -0.2227496 -0.5868347 0.0000721 0.0000587 0.0000669 -0.2543756 -0.8065698 -0.208114 0.0000453 -0.4123182 -0.834442 0.000144 0.0001176 0.0001301 -0.0803913 0.7935317 -0.2551448 -0.0000306 -0.4144215 0.272246 0.0000226 0.0000348 0.000025 1.3081014 1.4168027 0.1691248 0.0000017 0.0237409 1.3977695 -0.0002595 0.000032 -0.0002629 -0.1356689 0.8716797 0.316121 -0.0001121 0.6474897 1.1888182 -0.0001965 -0.000177 -0.0002127 0.1334556 0.0165573 -0.0704534 -0.0000004 0.0200291 0.0419433 -0.0000082 -0.0000103 0.0000058 -0.0428742 -0.0426398 0.1630742 -0.0000125 0.05802 -0.060105 0.000022 0.0000166 0.0000244 0.1053267 unknown
polarizability: 116.951742|4.5848116|83.6535051|-0.0019644|-0.0088094|61.3249128 unknown
InChI: InChI=1S/C4H2Cl4O/c5-3(6)2(1-9)4(7)8/h1,3H
charge 0 multiplicity 1
11 atoms
Cl -1.930219 0.914687 -1.541596
Cl -1.930633 0.914773 1.541055
Cl 2.157071 1.809306 -0.000252
Cl 2.76135 -1.121101 0.000274
O  -1.54453 -1.897867 0.000508
C  0.137306 -0.142089 0.000051
C  -0.87237 0.973097 -0.000122
C  1.475696 0.138043 0.000016
C  -0.335738 -1.571207 0.00036
H  -0.418686 1.969032 -0.000106
H  0.476452 -2.331773 0.000411
