program: Gaussian 09
title: 000155408
version: EM64L-G09RevD.01
frameworkgroup: C1[X(C19H32O3)]
method: RPBEPBE
basis: SDD
operation: Freq
keyword: #pfreq=noraman
keyword: PBEPBE/SDD
title: #p freq=noraman PBEPBE/SDD
converged: YES YES NO NO
title: Mulliken charges:
elementType: O O O C C C C C C C C C C C C C C C C C C C H H H H H H H H H H H H H H H H H H H H H H H H H H H H H H H H
charge: -0.208657 -0.201686 -0.231844 0.147357 0.153484 0.175777 0.350587 0.347113 -0.387869 -0.410731 -0.109636 -0.723375 -0.724360 -0.750201 -0.725350 -0.724944 -0.751268 -0.723219 0.334912 -0.692437 -0.709696 -0.692980 0.265117 0.278787 0.206403 0.203676 0.266328 0.203363 0.204545 0.269630 0.213637 0.221957 0.212130 0.268745 0.204238 0.203357 0.202445 0.213155 0.263412 0.221399 0.210609 0.220090 0.238549 0.239235 0.232813 0.219459 0.208173 0.228912 0.233890 0.232717 0.208071 0.239316 0.199483 0.225382
chargesum: 0.00000
title: Mulliken charges with hydrogens summed into heavy atoms:
elementType: O O O C C C C C C C C C C C C C C C C C C C
charge: -0.208657 -0.201686 -0.231844 0.147357 0.153484 0.175777 0.350587 0.347113 -0.122752 -0.131944 -0.109636 -0.046969 -0.046823 -0.102476 -0.049009 -0.045931 -0.099170 -0.012623 0.334912 -0.035893 -0.035018 -0.028800
polarizability: 2.46900136e+02 4.14920444e+00 2.18507178e+02 -1.16923772e+01 -4.87914073e+00 1.99121785e+02
1716.lowfreq: -16.2051 -9.8570 -9.2970 -0.0007 -0.0003 0.0002 8.3949 22.0849 35.7090
frequency: -9.9142 22.0198 35.6528 39.9637 62.0857 81.0195 97.8762 116.5161 141.9327 144.9370 157.1952 176.1881 191.4075 201.2678 202.4883 215.7766 226.6304 230.4927 236.4092 242.2597 248.5628 254.1137 262.1544 272.6996 279.9387 301.6255 315.9014 317.8294 322.3445 343.9266 349.0777 358.8788 361.2407 390.1014 400.7313 407.6124 420.5880 425.3686 433.4594 438.7313 446.8079 499.2485 506.6105 554.1700 564.8701 565.4155 632.6015 732.0656 733.2811 767.9421 785.1712 806.8790 813.1138 832.0333 841.3526 874.2295 879.7462 885.3222 907.8101 908.3991 917.9974 922.8515 925.0058 930.2659 932.0477 944.0841 945.0212 947.8607 981.2970 1015.5234 1018.3334 1023.7884 1024.3379 1028.4336 1029.8107 1037.7468 1063.3083 1141.7538 1158.9091 1186.3141 1203.0622 1204.3962 1214.9972 1217.1719 1248.5662 1250.5173 1262.0432 1271.9003 1303.4753 1327.2684 1349.2574 1364.9738 1365.4424 1366.7641 1370.4187 1371.1406 1371.4190 1372.3259 1392.5991 1396.5608 1396.7381 1442.2799 1454.0588 1454.9826 1455.1695 1461.9442 1464.8649 1467.8477 1468.9848 1470.3359 1470.7935 1471.3457 1474.7135 1475.8731 1476.7826 1477.7368 1488.9376 1490.2411 1496.1294 1504.3951 1506.6237 1535.4539 1618.9845 1658.3109 2966.5028 2969.2037 2974.5770 2974.9354 2978.4027 2979.2127 2985.4537 2989.4367 2993.7393 2994.5285 3059.4113 3059.9037 3062.8046 3064.2132 3064.8487 3065.7790 3074.1069 3075.2726 3081.4583 3087.0948 3095.3050 3095.4704 3098.3830 3100.6921 3103.6246 3107.4680 3109.1609 3109.3890 3113.9730 3115.7050 3135.9450 3147.7394
redmass: 3.5819 2.9380 3.5825 3.7216 2.7435 3.5702 3.7620 3.3526 1.1650 3.3666 2.4813 1.8985 1.6390 1.4725 1.0322 1.0526 1.6342 1.3837 1.1735 1.9859 2.1737 1.3758 2.1898 3.1299 2.6573 2.3463 1.1076 1.0864 2.6029 2.8800 4.2011 2.2286 2.3990 2.6812 2.4776 2.6393 3.8371 2.7699 2.9931 3.1424 3.7511 2.9627 3.0586 3.4409 3.8116 3.9530 4.6757 4.9496 4.8980 6.1499 3.9404 8.7614 4.8683 5.1000 3.1664 1.8871 1.8955 2.4890 1.7058 1.6230 1.5876 1.6956 1.6635 1.6792 1.6516 1.2158 1.2151 1.2053 1.4676 1.5601 1.4320 1.4265 1.3963 1.3723 1.3836 2.4714 2.2260 2.9978 2.1771 2.1545 2.9664 2.9620 2.6813 3.1268 2.5480 2.9939 3.2027 3.3282 3.9085 1.5866 2.1769 1.2324 1.1886 1.1863 1.1919 1.2211 1.2114 1.2124 1.2091 1.2163 1.2067 1.0489 1.0483 1.0645 1.0487 1.0525 1.0505 1.0566 1.0583 1.0670 1.0746 1.0589 1.0693 1.0606 1.0485 1.0544 1.0511 1.0519 1.0547 1.0693 1.0901 5.0690 9.1379 7.7347 1.0355 1.0355 1.0367 1.0366 1.0373 1.0373 1.0349 1.0350 1.0354 1.0335 1.1001 1.1001 1.0994 1.0995 1.0996 1.0995 1.0981 1.0983 1.0998 1.0996 1.1004 1.0995 1.1009 1.0998 1.0998 1.1006 1.0983 1.0983 1.0976 1.0972 1.0902 1.0904
irintensity: 0.8631 0.1844 0.2308 0.5717 0.1982 1.5780 1.8713 1.6374 0.3205 0.4829 0.4171 0.2397 0.2799 0.1983 0.0098 0.0617 0.2742 0.2272 0.0251 0.6324 0.1259 0.1187 1.4629 0.5545 0.8306 0.0593 0.1784 0.0952 2.2634 3.4960 9.5812 1.1383 0.9462 0.0912 0.1725 1.0346 8.7707 0.3629 1.1922 1.4772 1.1312 0.3761 1.6861 2.1791 2.2571 0.4535 0.7679 11.5096 9.6932 3.0913 1.0788 8.1115 10.7871 5.5582 13.9387 28.6355 23.4175 7.3912 14.8267 3.3227 0.8107 1.8734 8.1596 4.1959 12.7971 0.6025 0.9088 0.0555 3.0214 14.4184 1.3829 1.4193 0.9630 0.4800 3.7578 81.1763 10.9654 16.5075 31.6831 105.9279 1.3015 10.4270 0.0952 0.2085 77.1290 23.2139 21.5722 1.5204 0.2416 21.2120 29.5890 23.0109 19.6847 31.8479 54.8483 24.0529 14.9109 42.7165 23.6558 10.7768 32.3253 0.5513 0.0912 7.6349 0.2013 1.2872 4.4336 13.1356 2.5059 10.6133 29.3288 5.7255 21.2797 12.7498 2.8299 6.2878 2.9714 13.4855 29.5136 32.1345 34.0710 89.8035 29.5944 1.3952 20.4299 19.4640 20.9666 70.8439 56.6084 26.5373 21.7595 17.0455 22.7431 15.9494 3.2119 3.3174 36.5687 27.9835 19.5035 56.9456 93.2591 89.4853 15.3089 14.8861 10.4919 53.4118 15.3444 30.3532 33.5590 16.3695 5.2343 3.5318 14.4144 13.6951 12.4337 5.4558
temp: 298.150 k
press: 1.00000 atm
elementType: 8 8 8 6 6 6 6 6 6 6 6 6 6 6 6 6 6 6 6 6 6 6 1 1 1 1 1 1 1 1 1 1 1 1 1 1 1 1 1 1 1 1 1 1 1 1 1 1 1 1 1 1 1 1
symmnumber: 1
zpe: 1221269.6 jmol-1
zpe.correction: 0.465157 hartree
zpe.thermalcorrener: 0.491302 hartree
zpe.thermalcorrenthalpy: 0.492247 hartree
zpe.thermalcorrgfe: 0.411549 hartree
zpe.sumelectzpe: -967.047878 hartree
zpe.sumelectthermal: -967.021733 hartree
zpe.sumelectthermalent: -967.020789 hartree
zpe.sumelectthermalfe: -967.101487 hartree
dipole: -2.9835 -0.0235 1.2855
dipole: 3.2487
quadrupole: -137.2395 -132.5645 -132.5349
quadrupole: -4.9358 5.3052 0.9464
quadrupole: -3.1265 1.5485 1.5780 -4.9358 5.3052 0.9464
hfenergy: -967.5130353 hartree
pointgroup: C01 [X(C19H32O3)]
dipole: 1.1460003 0.2043819 -0.527782 debye
polarizability: 246.867478|1.2663686|217.7956805|-13.4385304|3.2184311|199.8659411 unknown
InChI: InChI=1S/C19H32O3/c1-16(2,3)13-11-19(10,22-21-18(7,8)9)12-14(15(13)20)17(4,5)6/h11-12H,1-10H3
charge 0 multiplicity 1
54 atoms
O  2.113672 -0.50046 -1.255093
O  2.284116 -0.624114 0.282468
O  -2.827528 0.181822 0.832031
C  -1.359414 2.634979 0.260329
C  -2.028467 -2.584131 0.349733
C  0.645951 -0.305169 -1.497251
C  -0.91887 1.231313 -0.216467
C  -1.253569 -1.353347 -0.176027
C  0.194474 1.035337 -0.983099
C  -0.128259 -1.471121 -0.941471
C  -1.739879 0.028692 0.180389
C  -1.407784 2.670094 1.819391
C  -2.766803 2.97692 -0.319272
C  -0.370525 3.734901 -0.20939
C  -3.481735 -2.58156 -0.217613
C  -2.071051 -2.552499 1.908967
C  -1.350833 -3.912437 -0.079138
C  0.613463 -0.325056 -3.054686
C  3.605338 -0.016019 0.644382
C  3.608018 1.493994 0.335767
C  3.623664 -0.288601 2.16549
C  4.743812 -0.759428 -0.083258
H  0.825464 1.875821 -1.291809
H  0.281236 -2.451224 -1.206571
H  -0.4175 2.427836 2.24948
H  -1.690047 3.684677 2.158411
H  -2.147264 1.953206 2.20847
H  -3.0656 3.991655 0.005718
H  -2.749975 2.963675 -1.425503
H  -3.522171 2.257861 0.032823
H  0.651543 3.566929 0.180259
H  -0.716018 4.713833 0.169261
H  -0.319669 3.803482 -1.312532
H  -4.026604 -1.678691 0.098107
H  -3.472229 -2.625126 -1.323175
H  -4.025596 -3.470381 0.154762
H  -2.596634 -3.451969 2.281761
H  -1.048057 -2.552854 2.329459
H  -2.605036 -1.661014 2.272962
H  -0.320386 -3.996934 0.314015
H  -1.318742 -4.025742 -1.179309
H  -1.934803 -4.759053 0.325062
H  1.008987 -1.285071 -3.428489
H  -0.424157 -0.200766 -3.40691
H  1.231091 0.495358 -3.45964
H  2.774534 1.995684 0.858735
H  4.557857 1.951572 0.667427
H  3.498871 1.663063 -0.748914
H  3.569978 -1.37189 2.368686
H  2.771765 0.205994 2.663349
H  4.561357 0.105121 2.596984
H  4.6610 -0.621325 -1.174411
H  5.7262 -0.374063 0.246125
H  4.697515 -1.840479 0.134722
