program: Gaussian 09
title: 000014028
version: EM64L-G09RevD.01
frameworkgroup: C1[X(C7H15O4P)]
method: RPBEPBE
basis: SDD
operation: Freq
keyword: #p
keyword: freq=noraman
keyword: PBEPBE/SDD
title: #p freq=noraman PBEPBE/SDD
converged: YES YES NO NO
title: Mulliken charges:
elementType: P O O O O C C C C C C C H H H H H H H H H H H H H H H
charge: 1.296578 -0.499942 -0.534394 -0.622002 -0.204275 -0.844948 0.273275 -0.232561 -0.214135 -0.742516 -0.658213 -0.655438 0.304802 0.294484 0.242072 0.219207 0.240482 0.217207 0.256173 0.279144 0.236875 0.207678 0.228594 0.240231 0.212657 0.227460 0.231506
chargesum: 0.00000
title: Mulliken charges with hydrogens summed into heavy atoms:
elementType: P O O O O C C C C C C C
charge: 1.296578 -0.499942 -0.534394 -0.622002 -0.204275 -0.245663 0.273275 0.228718 0.243555 0.029676 0.018289 0.016185
polarizability: 1.32598916e+02 1.90453633e+00 1.18599690e+02 -8.81980795e-01 -6.58315342e+00 9.44241272e+01
1716.lowfreq: -10.7829 -7.6434 0.0015 0.0017 0.0024 4.9990 30.6914 32.3611 50.8805
frequency: 30.5999 31.2930 50.5924 61.6847 70.0583 81.1621 96.7459 128.1941 139.6332 145.3404 204.3985 222.1124 238.7218 245.7241 277.1144 289.6704 342.6824 375.9339 392.8341 423.2057 494.8189 554.0858 625.6903 673.2925 713.8378 802.6182 807.6377 819.1495 862.1814 877.1183 878.2641 979.1073 1013.1643 1021.5675 1025.8254 1052.2158 1104.2929 1105.5516 1131.3361 1135.1886 1135.2376 1230.9565 1235.6463 1253.3858 1263.3061 1358.4287 1364.7306 1382.0162 1394.7822 1396.4508 1407.1323 1446.4478 1452.0322 1456.9499 1459.6369 1477.7860 1479.2573 1489.5386 1492.3781 1631.4184 2971.8337 2981.1392 2990.8628 2995.2390 2995.7670 3041.6939 3046.7744 3051.8850 3055.6981 3091.1823 3092.3585 3108.1042 3111.8769 3127.3198 3129.6936
redmass: 3.0494 3.3954 2.7526 2.9154 3.7580 2.6565 2.7567 3.9806 1.1341 4.1845 3.4226 4.8087 1.4144 1.2484 3.0176 4.4263 4.8253 2.6497 3.4830 4.8896 4.4067 3.7698 4.3211 5.6565 4.8321 3.6573 1.0890 1.0937 1.9803 4.1320 3.0422 1.9542 2.5046 2.1280 2.1384 3.9011 2.2023 2.1153 1.3868 1.4263 1.4240 2.7647 1.3152 1.1453 1.1437 1.2569 1.2344 1.2472 1.2394 1.2474 1.0994 1.0716 1.0592 1.0394 1.0403 1.0512 1.0483 1.0826 1.0843 7.5941 1.0388 1.0550 1.0514 1.0415 1.0374 1.0599 1.1077 1.0952 1.1076 1.0982 1.0980 1.1022 1.1020 1.1020 1.1023
irintensity: 0.8365 1.1069 1.8767 3.2197 3.8124 6.7650 1.6071 3.8675 1.2114 11.3046 0.5453 3.6527 2.4046 0.7783 11.7146 12.5977 18.6478 1.5497 9.8282 7.8237 47.0870 13.3004 29.5350 87.9762 60.6209 39.2998 3.7562 4.9994 25.0325 230.8760 80.4624 15.4652 137.9080 75.1285 55.8367 62.2194 4.5776 14.1348 55.7032 3.0032 5.0716 123.6794 65.2863 0.0713 0.7943 6.1533 2.3868 79.2983 18.0429 28.6216 26.9384 27.4017 22.8958 11.3094 12.7913 8.0068 2.8027 14.6409 2.5095 129.7604 3.6794 25.8138 26.0165 26.4045 23.3975 0.9792 10.9058 3.2001 11.3455 27.9802 27.0253 36.4176 29.5986 5.7598 3.4559
temp: 298.150 k
press: 1.00000 atm
elementType: 15 8 8 8 8 6 6 6 6 6 6 6 1 1 1 1 1 1 1 1 1 1 1 1 1 1 1
symmnumber: 1
zpe: 568965.4 jmol-1
zpe.correction: 0.216707 hartree
zpe.thermalcorrener: 0.233138 hartree
zpe.thermalcorrenthalpy: 0.234083 hartree
zpe.thermalcorrgfe: 0.170718 hartree
zpe.sumelectzpe: -916.863233 hartree
zpe.sumelectthermal: -916.846802 hartree
zpe.sumelectthermalent: -916.845858 hartree
zpe.sumelectthermalfe: -916.909222 hartree
dipole: -2.2896 0.0236 -2.5541
dipole: 3.4302
quadrupole: -76.3217 -73.8668 -88.9460
quadrupole: -6.4348 2.6255 3.7704
quadrupole: 3.3898 5.8447 -9.2345 -6.4348 2.6255 3.7704
hfenergy: -917.0799401 hartree
pointgroup: C01[X(C7H15O4P1)]
dipole: 0.9999845 -0.1174524 -0.8986116 debye
polarizability: 131.9972994|1.8553244|119.9156395|4.5672427|3.6458108|93.7097947 unknown
InChI: InChI=1S/C7H15O4P/c1-4-10-12(9,11-5-2)6-7(3)8/h4-6H2,1-3H3
charge 0 multiplicity 1
27 atoms
P  0.155523 0.661884 -0.043123
O  -0.221448 -0.941684 0.498648
O  1.719219 0.56566 -0.800498
O  -0.000884 1.713362 1.139879
O  -2.955419 -0.266999 -1.718019
C  -0.881224 0.979882 -1.587084
C  -2.376117 0.777752 -1.318474
C  -0.166894 -2.095439 -0.45498
C  2.933833 0.704971 0.06229
C  -3.076522 1.87957 -0.547663
C  -0.444038 -3.340567 0.381694
C  4.129244 0.739993 -0.884643
H  -0.534768 0.288322 -2.370447
H  -0.653964 2.021938 -1.870003
H  -0.941069 -1.954259 -1.233662
H  0.834731 -2.128765 -0.925796
H  2.844079 1.634026 0.655302
H  2.982578 -0.157626 0.754202
H  -4.090472 1.563707 -0.260685
H  -2.487695 2.151303 0.35043
H  -3.144281 2.791845 -1.172252
H  -0.429007 -4.238401 -0.26394
H  0.31709 -3.459801 1.171249
H  -1.435544 -3.269705 0.859081
H  5.064639 0.841192 -0.303661
H  4.1861 -0.18713 -1.480113
H  4.053012 1.596068 -1.576232
