program: Gaussian 09
title: 000155381
version: EM64L-G09RevD.01
frameworkgroup: C1[X(C19H18O7)]
method: RPBEPBE
basis: SDD
operation: Freq
keyword: #pfreq=noraman
keyword: PBEPBE/SDD
title: #p freq=noraman PBEPBE/SDD
converged: YES YES NO NO
title: Mulliken charges:
elementType: O O O O O O O C C C C C C C C C C C C C C C C C C C H H H H H H H H H H H H H H H H H H
charge: -0.329981 -0.289412 -0.303413 -0.222152 -0.204281 -0.268508 -0.402242 0.253356 0.192920 0.270857 0.354793 -0.116560 -0.260012 0.028357 0.105101 -0.630164 0.417523 -0.614193 -0.026267 0.054221 0.246270 -0.788593 -0.518233 -0.512836 -0.522252 -0.516119 0.296166 0.316635 0.226085 0.245949 0.242961 0.384573 0.253882 0.226078 0.227696 0.213431 0.290745 0.230495 0.271147 0.227884 0.228188 0.234589 0.220275 0.265045
chargesum: 0.00000
title: Mulliken charges with hydrogens summed into heavy atoms:
elementType: O O O O O O O C C C C C C C C C C C C C C C C C C C
charge: -0.329981 -0.289412 -0.303413 -0.222152 -0.204281 -0.268508 -0.017669 0.253356 0.192920 0.270857 0.354793 -0.116560 -0.260012 0.028357 0.105101 -0.333998 0.417523 -0.297558 -0.026267 0.054221 0.246270 -0.073598 0.216438 0.194819 0.204967 0.203790
polarizability: 4.09870432e+02 -7.19443447e+00 2.76083197e+02 -5.08212419e+00 2.65955742e+00 1.23560170e+02
1716.lowfreq: -7.1597 -1.5748 -0.0008 -0.0004 0.0004 5.1635 27.4904 31.7179 49.7286
frequency: 27.4673 31.6043 49.7181 56.0483 74.8905 87.5794 94.9354 95.6624 101.3193 114.1674 121.0790 125.3623 142.8054 143.4832 157.7656 166.5262 170.2994 195.1250 207.2270 218.7757 226.1725 238.1669 271.4978 280.5044 297.8669 311.4066 320.7178 328.3825 348.4192 358.6576 372.9887 392.8363 414.7257 431.1180 464.7112 485.7957 510.1294 525.5541 567.6817 571.6754 583.1149 612.2405 628.4325 652.9584 674.0686 682.0558 699.3198 729.8324 758.7997 774.5038 789.7270 819.5142 839.0593 852.4699 870.6304 913.9812 929.9387 942.4696 948.1471 991.7331 1006.4226 1020.1447 1050.3231 1062.4702 1075.5142 1102.6029 1108.4789 1109.9005 1110.6239 1136.8784 1151.6744 1153.1933 1155.0776 1157.9579 1180.6282 1195.5705 1207.2043 1246.5220 1267.7134 1299.5122 1316.2581 1361.9369 1370.9558 1398.1657 1401.5367 1406.1170 1411.6778 1425.8879 1429.8770 1436.7476 1444.5593 1448.5362 1449.9066 1456.2735 1456.4835 1457.9770 1459.1542 1470.2032 1475.6066 1481.5467 1485.3871 1492.4778 1524.0109 1535.4048 1553.5577 1577.3327 1590.2931 1615.6560 2980.7632 2981.2148 2984.8685 2986.4440 2987.4142 3063.2304 3089.7436 3093.5512 3098.5255 3100.5561 3101.9930 3127.0684 3130.7316 3139.1289 3140.4286 3152.6984 3172.8065 3383.2802
redmass: 5.9208 4.2813 2.6265 2.6767 3.9249 2.9533 1.3410 1.9460 2.8966 2.1027 3.0988 4.9117 1.3547 1.2283 2.6888 1.2498 1.9974 4.3416 5.0570 4.0653 3.8867 4.7077 4.1631 5.2011 6.3212 6.2604 7.1117 6.4870 6.0091 8.7758 5.9507 6.5983 6.1780 7.7065 10.7439 6.9410 7.3552 6.7800 5.3263 7.3486 4.7352 5.3696 6.3591 6.7761 8.4606 1.1157 5.7230 6.5427 6.8227 6.7682 7.8290 7.2653 5.6784 6.6561 8.2874 8.3435 1.4430 7.0621 1.5970 2.2483 6.7560 3.3793 1.5451 5.8576 3.0390 1.2574 1.2542 1.2441 1.2468 3.0014 1.3609 1.3669 1.5035 1.6726 1.5567 4.5260 1.9547 5.0904 2.1287 3.8348 7.1063 5.6351 4.5075 1.4720 1.9254 2.2325 1.7266 1.3357 1.7744 1.3967 1.9904 1.2438 3.7195 1.0792 1.0499 1.0911 1.1906 1.2720 1.0572 1.0548 1.0550 1.0568 8.6836 8.5322 8.0382 7.4028 7.5100 7.2737 1.0324 1.0315 1.0309 1.0370 1.0339 1.0965 1.1033 1.1024 1.0981 1.0986 1.1002 1.1036 1.1048 1.1055 1.1056 1.0918 1.0918 1.0624
irintensity: 2.7025 0.6987 1.8026 3.9816 2.0623 2.8538 1.7816 3.3792 6.3083 3.2265 0.1427 4.5242 0.6864 0.6090 2.5592 0.8711 0.7829 3.9505 3.5247 5.6384 6.2039 0.7697 3.4342 24.5016 11.3751 2.5329 0.9719 12.2697 9.4777 6.2061 11.9059 4.0324 9.1127 1.1705 1.9572 2.4866 1.9263 0.4494 7.1593 16.2494 6.1081 0.5647 7.4470 5.8933 95.5496 121.2263 3.5231 9.7354 10.2382 6.2629 13.8652 2.9852 4.5759 12.2597 11.8351 24.7238 12.6716 144.9278 25.3019 22.6889 52.8476 31.5862 8.9398 242.8200 46.4623 3.8948 50.6188 27.5859 6.2097 20.9134 7.4794 8.8514 11.0140 29.6378 5.1762 59.1175 40.0339 73.8156 114.6627 308.6598 1172.7666 183.1286 29.8190 5.2285 20.8829 6.8025 19.6254 50.2169 35.7765 13.9742 16.9237 17.4238 22.7290 5.5895 18.2011 1.8510 11.8537 7.6043 5.8045 26.9111 20.2004 21.5371 12.4929 503.0811 12.8067 14.3011 56.0126 12.0648 49.6269 114.3208 74.3534 23.9198 95.8541 12.5811 18.7075 19.0535 34.3909 30.1731 12.5798 19.6986 16.8690 4.0457 10.5419 4.0036 4.8518 94.9057
temp: 298.150 k
press: 1.00000 atm
elementType: 8 8 8 8 8 8 8 6 6 6 6 6 6 6 6 6 6 6 6 6 6 6 6 6 6 6 1 1 1 1 1 1 1 1 1 1 1 1 1 1 1 1 1 1
symmnumber: 1
zpe: 868729.5 jmol-1
zpe.correction: 0.330882 hartree
zpe.thermalcorrener: 0.356962 hartree
zpe.thermalcorrenthalpy: 0.357906 hartree
zpe.thermalcorrgfe: 0.274580 hartree
zpe.sumelectzpe: -1259.445694 hartree
zpe.sumelectthermal: -1259.419614 hartree
zpe.sumelectthermalent: -1259.418670 hartree
zpe.sumelectthermalfe: -1259.501996 hartree
dipole: 1.6329 3.2764 -1.1336
dipole: 3.8323
quadrupole: -120.2265 -153.0344 -146.5451
quadrupole: 1.8968 3.0010 -4.5397
quadrupole: 19.7088 -13.0990 -6.6097 1.8968 3.0010 -4.5397
hfenergy: -1259.7765755 hartree
pointgroup: C01 [X(C19H18O7)]
dipole: 0.6528694 1.2701568 -0.4834221 debye
polarizability: 409.177726|-9.56147|276.4185748|-11.8273194|0.4123044|123.9174985 unknown
InChI: InChI=1S/C19H18O7/c1-8-6-9-12(18(25-4)14(8)20)16(22)13-10(15(9)21)7-11(23-2)17(24-3)19(13)26-5/h6-7,20H,1-5H3
charge 0 multiplicity 1
44 atoms
O  -3.241882 2.238298 0.136166
O  2.176801 2.19594 0.192798
O  4.520365 0.705027 0.13978
O  -0.45863 2.181035 -0.678507
O  -0.506679 -3.276417 -0.492277
O  4.36534 -2.175612 -0.251602
O  -5.35917 0.762792 0.561512
C  -1.748494 0.1991 -0.169343
C  0.806977 0.176048 -0.235155
C  -1.752099 -1.235821 -0.17295
C  0.794035 -1.251814 -0.323078
C  -0.465386 0.944705 -0.369278
C  -0.4947 -2.008848 -0.358557
C  -2.998465 0.848543 0.028838
C  2.069849 0.822806 -0.076884
C  -2.950959 -1.96536 0.01513
C  -4.184196 -1.333384 0.261675
C  1.992872 -1.988147 -0.357621
C  -4.177794 0.08369 0.286396
C  3.280146 0.067609 -0.052903
C  3.244366 -1.345801 -0.252797
C  -5.467631 -2.092362 0.503381
C  -3.214662 3.045529 -1.115727
C  2.44596 3.05978 -0.979557
C  4.717232 1.312875 1.483069
C  5.57472 -1.762383 -1.002118
H  -2.884876 -3.057651 -0.018409
H  1.948889 -3.076568 -0.452703
H  -5.301274 -3.18049 0.450214
H  -5.890443 -1.845078 1.49443
H  -6.23879 -1.814766 -0.238569
H  -5.117972 1.734566 0.607594
H  1.575571 3.037422 -1.656229
H  3.369465 2.732206 -1.492498
H  2.575962 4.072069 -0.56823
H  -3.878812 2.591592 -1.875747
H  -2.177537 3.111957 -1.47389
H  -3.591811 4.035762 -0.817672
H  3.941923 2.073268 1.671691
H  4.689084 0.524371 2.257676
H  5.716102 1.773109 1.446271
H  6.286701 -2.587305 -0.85209
H  5.330883 -1.664867 -2.07668
H  5.975722 -0.811824 -0.619548
