program: Gaussian 09
title: 000155370
version: EM64L-G09RevD.01
frameworkgroup: C1[X(C15H18F3NO2)]
method: RPBEPBE
basis: SDD
operation: Freq
keyword: #p
keyword: freq=noraman
keyword: PBEPBE/SDD
title: #p freq=noraman PBEPBE/SDD
converged: YES YES NO NO
title: Mulliken charges:
elementType: F F F O O N C C C C C C C C C C C C C C C H H H H H H H H H H H H H H H H H H
charge: -0.178420 -0.159014 -0.160535 -0.275618 -0.268891 -0.483728 0.111492 -0.503839 -0.504720 -0.788843 0.188129 0.545134 -0.621223 -0.369319 0.159822 0.310853 -0.340097 0.021768 0.260725 -0.689019 -0.687006 0.233006 0.277633 0.276946 0.233200 0.236654 0.222340 0.220372 0.338321 0.259350 0.315948 0.246666 0.200923 0.216401 0.242039 0.236865 0.203934 0.239342 0.232408
chargesum: 0.00000
title: Mulliken charges with hydrogens summed into heavy atoms:
elementType: F F F O O N C C C C C C C C C C C C C C C
charge: -0.178420 -0.159014 -0.160535 -0.275618 -0.268891 -0.145406 0.111492 0.006800 0.005425 -0.109477 0.188129 0.545134 -0.361872 -0.053371 0.159822 0.310853 -0.093431 0.222691 0.260725 0.006286 -0.011322
polarizability: 2.88228536e+02 5.71658533e+00 1.75428627e+02 1.76278484e+00 1.54791670e+00 1.13727361e+02
1716.lowfreq: -4.3518 -1.1046 -0.0005 0.0005 0.0006 5.7663 28.3305 30.1214 40.7156
frequency: 28.3030 30.1015 40.7073 54.2773 60.3046 72.5253 83.7456 97.5543 131.5350 164.4823 171.7593 183.7451 198.6450 220.7501 245.8649 259.9764 269.5714 278.6849 301.5739 309.3860 328.8023 345.6174 375.3592 375.9719 387.9458 404.4094 430.6446 440.7424 457.7002 510.1484 530.0229 568.9799 586.0974 610.2911 622.4369 641.2776 693.9258 711.8091 725.2706 737.1206 785.9303 802.1264 807.0331 835.1165 843.0031 875.2306 895.5939 917.5690 923.9786 929.6110 937.7981 941.5553 942.6399 983.2833 986.1460 997.5277 1030.3469 1038.7311 1051.9871 1065.5382 1098.5423 1101.3758 1142.8068 1150.4411 1156.9901 1171.2072 1183.4151 1227.4389 1234.1842 1267.7184 1297.9680 1306.8373 1318.3360 1324.6617 1343.9815 1375.5201 1384.6597 1396.5229 1399.9747 1416.7370 1422.9123 1446.5774 1455.3203 1468.0031 1470.6550 1481.8787 1487.2656 1487.6629 1494.5335 1516.4582 1584.9611 1603.3722 1634.7922 2960.1233 2978.7681 2991.0071 2997.3528 3042.8343 3076.7304 3087.3296 3095.8732 3097.3854 3099.2710 3104.7059 3107.0942 3147.8267 3168.4853 3193.2696 3204.8882 3222.3037 3536.3567
redmass: 3.3242 4.4288 7.7212 5.7670 3.8233 4.3865 4.8284 5.5868 5.0130 4.7663 5.0812 1.0272 5.0256 1.3629 1.1613 3.0679 4.2353 2.7458 5.6123 3.4863 4.0651 2.9142 3.4759 4.0683 4.1001 4.0661 5.7794 3.9651 3.8270 4.5281 5.9714 4.7010 6.9973 2.1649 9.2602 1.6824 8.3470 6.6240 4.1059 4.1865 1.0648 3.4814 3.7057 1.4787 3.7065 4.8925 1.5278 3.7039 3.2424 1.3108 1.2608 1.3482 1.4363 5.7424 1.3921 10.0714 3.0943 2.4058 1.3111 1.3588 1.5214 1.6967 2.2148 1.9148 2.0384 1.3151 2.0028 1.9480 3.2944 1.7134 3.0095 2.7227 1.3421 2.7624 1.3842 6.2035 1.2549 1.2807 1.2193 4.7259 1.0862 1.3285 1.0480 1.0537 1.0516 1.1388 1.1223 1.0444 2.3592 2.2652 9.4663 3.6774 6.6029 1.0382 1.0845 1.0361 1.0362 1.1001 1.0959 1.0991 1.1004 1.0508 1.0997 1.0620 1.1006 1.0914 1.0892 1.0956 1.1172 1.1157 1.0758
irintensity: 3.2342 0.8822 0.2640 1.1579 3.1961 3.5228 2.8794 0.5382 0.2215 1.5233 0.3733 0.0775 1.2149 0.3839 0.5334 2.2661 0.7435 1.6860 7.4450 0.0129 0.5760 0.0591 1.6723 4.4761 3.3201 3.4387 0.3074 2.3442 2.8960 7.6639 11.5081 0.1510 24.7407 40.3647 12.8239 16.7012 1.6523 10.9991 7.3334 2.9865 0.9594 47.3755 0.4566 37.7837 37.4606 20.5659 59.6149 98.6198 7.9794 8.6237 0.6486 0.5621 5.9647 122.6797 8.6499 216.4683 75.8091 35.0462 13.6566 1.0866 10.1049 99.2449 258.6295 12.6615 21.0407 0.5735 29.8041 278.7747 234.2842 30.0627 5.9290 77.4357 16.0366 102.5882 5.8364 20.5178 26.5666 29.6846 29.4006 7.7713 14.7320 17.8916 6.5512 7.8157 7.5996 222.5708 49.6837 9.4243 470.3762 318.8199 9.7893 86.4068 3.1761 29.9308 27.2088 13.4892 22.4277 27.8097 27.0233 19.1450 24.5989 17.0084 33.5126 17.4210 29.2085 6.7254 9.1431 12.4207 0.1904 9.5161 23.2311
temp: 298.150 k
press: 1.00000 atm
elementType: 9 9 9 8 8 7 6 6 6 6 6 6 6 6 6 6 6 6 6 6 6 1 1 1 1 1 1 1 1 1 1 1 1 1 1 1 1 1 1
symmnumber: 1
zpe: 796976.9 jmol-1
zpe.correction: 0.303552 hartree
zpe.thermalcorrener: 0.325053 hartree
zpe.thermalcorrenthalpy: 0.325997 hartree
zpe.thermalcorrgfe: 0.251888 hartree
zpe.sumelectzpe: -1085.534832 hartree
zpe.sumelectthermal: -1085.513331 hartree
zpe.sumelectthermalent: -1085.512387 hartree
zpe.sumelectthermalfe: -1085.586496 hartree
dipole: 2.2436 -1.3189 0.1598
dipole: 2.6074
quadrupole: -107.1073 -124.3258 -125.4928
quadrupole: 30.4307 1.3353 0.1567
quadrupole: 11.8680 -5.3505 -6.5175 30.4307 1.3353 0.1567
hfenergy: -1085.838384 hartree
pointgroup: C01 [X(C15H18F3N1O2)]
dipole: 0.8867316 -0.4888326 -0.1645779 debye
polarizability: 288.0727329|7.5327062|165.8816696|-1.8675384|22.3951902|123.4301216 unknown
InChI: InChI=1S/C15H18F3NO2/c1-9(2)21-12-5-4-10(8-11(12)15(16,17)18)19-13(20)14(3)6-7-14/h4-5,8-9,19H,6-7H2,1-3H3
charge 0 multiplicity 1
39 atoms
F  -1.6300 2.984486 1.449378
F  -3.206257 2.423659 -0.072937
F  -3.170416 1.405516 1.951723
O  3.221731 -1.567871 -0.913616
O  -3.309046 -0.47385 -0.258679
N  2.285447 0.359521 0.03761
C  4.734131 0.164665 -0.108242
C  5.804149 -0.244903 -1.153294
C  5.821989 -0.889935 0.225372
C  4.848796 1.543853 0.536711
C  3.364584 -0.427785 -0.366457
C  0.895787 0.0711 -0.06881
C  -0.013183 1.036463 0.428637
C  0.382238 -1.122872 -0.639355
C  -1.404153 0.828629 0.363728
C  -1.923182 -0.369603 -0.212412
C  -1.008322 -1.333171 -0.704717
C  -3.953268 -1.723112 -0.771605
C  -2.336693 1.874274 0.903758
C  -3.883472 -2.825807 0.298117
C  -5.385253 -1.30366 -1.11449
H  6.564002 0.503163 -1.399113
H  5.455047 -0.861517 -1.985217
H  5.485209 -1.92735 0.292988
H  6.593125 -0.590686 0.9416
H  5.911475 1.821076 0.648241
H  4.377823 2.334036 -0.0810
H  4.406775 1.567494 1.552637
H  2.513523 1.257724 0.468129
H  0.35661 1.965675 0.875443
H  1.08046 -1.869419 -1.021688
H  -1.371282 -2.262722 -1.150424
H  -3.422265 -2.032311 -1.695435
H  -4.366372 -3.746733 -0.07652
H  -2.843624 -3.070973 0.574406
H  -4.414759 -2.498827 1.208792
H  -5.946178 -2.164101 -1.521414
H  -5.384989 -0.493905 -1.86315
H  -5.903087 -0.939121 -0.210596
