program: Gaussian 09
title: 000155287
version: EM64L-G09RevD.01
frameworkgroup: C1[X(C28H22O8)]
method: RPBEPBE
basis: SDD
operation: Freq
keyword: #pfreq=noraman
keyword: PBEPBE/SDD
title: #p freq=noraman PBEPBE/SDD
converged: YES YES NO NO
title: Mulliken charges:
elementType: O O O O O O O O C C C C C C C C C C C C C C C C C C C C C C C C C C C C H H H H H H H H H H H H H H H H H H H H H H
charge: -0.269119 -0.438301 -0.430879 -0.524270 -0.491618 -0.426127 -0.525471 -0.428287 -0.423642 -0.318425 0.036662 0.278142 0.672871 0.645665 0.390062 -0.607948 -0.673176 -0.568953 -0.612813 -0.616361 0.347531 -0.402051 -0.283123 0.342662 0.378714 0.185029 -0.318440 -0.561104 0.130095 -0.396599 0.594441 -0.504473 -0.452759 0.135009 -0.338581 0.120172 0.273623 0.251958 0.247278 0.252686 0.271027 0.251887 0.231143 0.249538 0.210945 0.253252 0.255248 0.231213 0.356423 0.363211 0.379666 0.374532 0.384907 0.229453 0.235288 0.248102 0.418809 0.385274
chargesum: 0.00000
title: Mulliken charges with hydrogens summed into heavy atoms:
elementType: O O O O O O O O C C C C C C C C C C C C C C C C C C C C C C C C C C C C
charge: -0.269119 -0.081878 -0.067668 -0.144604 -0.117087 -0.041219 -0.106662 -0.043013 -0.150020 -0.066467 0.036662 0.278142 0.672871 0.645665 0.390062 -0.360670 -0.420490 -0.297927 -0.360926 -0.385217 0.347531 -0.152513 -0.072178 0.342662 0.378714 0.185029 -0.065187 -0.305856 0.130095 -0.165386 0.594441 -0.275020 -0.217472 0.135009 -0.090479 0.120172
polarizability: 4.89394796e+02 4.15202578e+01 4.01344425e+02 2.09514199e+01 8.37092264e-01 2.47424875e+02
1716.lowfreq: -5.7506 -0.8474 -0.0009 -0.0008 -0.0007 3.1410 14.5152 18.0988 24.5526
frequency: 13.9446 17.9410 24.4990 28.0901 42.2063 50.3664 54.1082 72.1605 87.3197 110.7457 135.7239 145.0483 152.9645 161.4071 171.6323 181.0151 199.9457 206.1651 219.5201 224.1182 234.3672 247.6012 252.3174 262.9579 268.4065 278.0732 284.7777 300.7315 307.0045 322.3056 332.1198 340.4950 362.3091 370.9363 376.4440 384.1605 408.0575 428.5233 430.8067 441.5503 468.3217 478.0816 486.4978 490.0132 498.6725 508.1767 524.2463 532.1748 532.3172 558.1299 568.9677 573.9848 582.3457 589.2203 593.5989 602.1394 608.3111 620.8633 628.9489 651.1816 682.2195 689.8475 698.7464 710.5112 724.9333 731.9403 757.3180 760.0036 767.7639 783.3783 796.6016 808.4264 812.0941 822.1508 825.0886 837.2935 843.2497 844.3679 856.9888 861.3249 876.8941 887.3204 898.9977 933.9242 936.6515 948.2824 959.9495 966.4131 973.7914 978.0481 983.0260 985.7611 1002.1019 1038.7167 1074.6673 1097.8546 1101.6741 1127.5665 1131.0605 1143.3834 1146.7049 1155.8983 1161.5889 1167.3294 1178.6494 1183.2383 1185.1054 1189.7421 1203.4439 1208.8567 1233.3506 1237.6591 1251.3509 1254.1645 1275.0037 1279.4263 1289.1517 1293.9350 1298.9762 1307.8727 1331.2794 1335.2324 1353.7234 1361.1018 1365.1593 1401.8102 1405.0571 1417.3030 1423.8819 1439.2933 1447.3993 1456.9300 1466.6781 1467.0577 1493.4362 1525.7788 1529.7971 1577.1965 1597.9939 1605.3477 1612.9473 1616.1704 1626.3276 1631.1229 1635.4357 1646.0609 2967.2829 3004.3107 3100.3511 3112.9046 3118.9921 3133.9342 3145.6475 3151.0480 3151.1994 3161.2007 3162.2359 3170.0722 3171.3686 3173.5095 3174.2373 3279.3176 3496.7004 3526.3433 3585.0654 3586.6128 3589.8227 3623.6600
redmass: 6.8100 5.7098 6.7161 6.5749 7.1643 6.6589 6.6585 6.3816 4.4300 7.3355 6.8806 6.1439 6.7794 6.2682 3.9368 4.8580 5.9456 4.2701 5.7842 5.3116 4.9541 5.5979 4.6312 3.1494 1.4006 4.7836 4.9019 4.7520 5.2259 5.1025 4.0579 1.1859 1.2121 2.0663 3.5082 2.0023 5.0575 5.3588 2.9708 3.0636 6.5785 4.1101 6.2384 1.1618 4.1897 6.7900 6.4927 1.2513 4.1751 6.0700 4.1169 6.0903 4.9437 4.7176 4.6900 4.7557 3.9562 4.0400 4.6096 4.6423 5.5213 2.1745 5.1238 2.9574 3.4660 3.4213 6.1667 5.7720 1.2477 4.3998 4.9349 1.6470 1.4511 1.4601 1.6775 2.3195 1.5965 1.7082 1.6900 2.0745 1.8977 2.2980 3.1633 3.1231 1.4137 1.5401 3.4777 3.5012 2.1236 1.7630 5.7510 3.7333 4.0384 4.7999 2.3566 2.3395 2.7342 1.5701 1.2973 1.4722 1.6375 1.5235 1.2904 1.3385 1.6240 1.3713 1.4420 1.3405 1.4692 1.3846 2.3813 1.4999 1.5384 1.4672 1.5987 1.5870 1.9998 1.6042 1.9785 2.1193 3.4833 2.4867 1.5109 1.7371 1.7069 5.1241 4.3563 3.9011 3.7946 3.6154 4.8540 3.4576 3.9778 3.2720 2.9872 3.3299 2.8902 7.6287 6.3755 5.8352 5.8409 6.5446 7.0652 7.1656 6.4663 5.4836 1.0829 1.0861 1.0905 1.0915 1.0917 1.0894 1.0891 1.0929 1.0926 1.0923 1.0870 1.0929 1.0912 1.0894 1.0960 1.0702 1.0645 1.0649 1.0662 1.0661 1.0658 1.0667
irintensity: 0.2678 0.9130 0.3632 0.6921 0.5476 0.4698 1.3758 1.2684 0.4929 2.7270 0.4390 0.9349 0.6420 1.2139 0.0892 1.4385 1.0205 1.1003 3.1553 1.0590 0.5630 1.6185 1.9081 24.7988 129.6276 5.1143 7.7820 9.0400 5.5506 4.6000 17.9521 132.0517 12.6578 147.6258 52.4775 64.7489 8.3365 27.2155 4.2036 11.5010 22.2877 15.4309 5.6991 127.7777 3.5066 3.6996 4.6985 132.8774 10.0479 16.0718 21.9411 33.9478 11.4840 0.6512 0.2156 2.8382 12.4411 6.8677 18.3312 9.5364 5.3298 35.5937 20.9661 4.3153 9.2836 9.8102 50.5252 5.5573 65.5448 24.5812 6.7534 44.5998 9.8872 21.1016 7.5432 7.8625 32.4145 29.8222 20.9464 24.2372 6.0996 2.7157 99.4502 5.9769 1.9068 1.4599 54.1645 37.7272 139.5562 77.3352 0.3452 41.3658 21.4726 96.9991 116.0376 30.3582 234.7511 220.1756 29.9398 47.6171 65.3653 87.2190 40.5329 6.5863 20.8514 359.8903 228.0068 34.5743 44.3985 28.8106 130.4757 88.1190 70.2963 42.4206 95.8832 102.7617 118.0586 39.9862 18.7420 51.2052 105.1455 3.3788 17.9256 20.2446 26.2771 12.1976 27.8107 25.5789 12.2281 76.6764 85.6581 81.5007 22.8665 87.3219 19.1580 91.6334 89.8956 220.0978 94.5098 73.6404 222.7225 28.2058 23.0131 121.1954 132.0293 13.5221 17.3627 27.5383 14.3830 9.9194 3.6256 9.3046 8.2438 1.8879 3.9118 0.3354 13.6658 8.6712 4.0889 14.7102 4.1402 502.4221 118.6081 106.0582 51.0513 54.0468 45.8539 54.5595
temp: 298.150 k
press: 1.00000 atm
elementType: 8 8 8 8 8 8 8 8 6 6 6 6 6 6 6 6 6 6 6 6 6 6 6 6 6 6 6 6 6 6 6 6 6 6 6 6 1 1 1 1 1 1 1 1 1 1 1 1 1 1 1 1 1 1 1 1 1 1
symmnumber: 1
zpe: 1139719.2 jmol-1
zpe.correction: 0.434096 hartree
zpe.thermalcorrener: 0.465717 hartree
zpe.thermalcorrenthalpy: 0.466661 hartree
zpe.thermalcorrgfe: 0.370513 hartree
zpe.sumelectzpe: -1679.422904 hartree
zpe.sumelectthermal: -1679.391283 hartree
zpe.sumelectthermalent: -1679.390339 hartree
zpe.sumelectthermalfe: -1679.486487 hartree
dipole: 3.4714 -3.8311 3.0513
dipole: 6.0032
quadrupole: -237.2523 -185.9930 -203.1014
quadrupole: -3.4445 6.6117 -11.2537
quadrupole: -28.4701 22.7892 5.6809 -3.4445 6.6117 -11.2537
hfenergy: -1679.8570001 hartree
pointgroup: C01 [X(C28H22O8)]
dipole: -1.2929196 1.4671614 1.3244206 debye
polarizability: 492.6948342|39.0870248|396.9592079|-19.0231364|11.6073644|248.5100535 unknown
InChI: InChI=1S/C28H22O8/c29-18-9-17(10-19(30)12-18)27-26-15(3-1-14-2-5-21(32)23(34)7-14)8-20(31)13-25(26)36-28(27)16-4-6-22(33)24(35)11-16/h1-13,27-35H
charge 0 multiplicity 1
58 atoms
O  -3.120259 -1.981435 0.346997
O  -0.408299 -6.058413 -0.23449
O  0.861484 0.877833 4.286318
O  1.936437 3.450607 0.293712
O  -5.993562 3.312386 0.61558
O  -6.543146 2.934096 -2.000005
O  4.650256 2.806424 -0.202029
O  7.080401 2.064369 -1.116166
C  -1.259711 -0.401394 0.001157
C  -2.735929 -0.532957 0.548433
C  -0.797284 -1.866686 -0.029281
C  -1.92485 -2.694826 0.145749
C  -0.410471 0.56279 0.830194
C  -3.755051 0.360947 -0.117486
C  0.476539 -2.447855 -0.302072
C  -1.870095 -4.095879 0.09107
C  0.236844 1.653397 0.190995
C  -0.182316 0.329527 2.204142
C  0.555612 -3.870399 -0.352134
C  -4.383893 1.392293 0.623876
C  -0.593141 -4.664858 -0.161621
C  -4.077686 0.19878 -1.488342
C  1.631318 -1.568405 -0.50412
C  0.695869 1.168784 2.926586
C  1.14052 2.449466 0.92489
C  -5.30381 2.246232 -0.008773
C  -5.008364 1.051294 -2.117985
C  1.380355 2.234297 2.29426
C  -5.622961 2.083941 -1.382647
C  2.945195 -1.877958 -0.7511
C  4.012033 -0.866788 -0.843124
C  3.776996 0.489452 -0.460406
C  5.314162 -1.211789 -1.302281
C  4.785457 1.45283 -0.560244
C  6.338778 -0.243123 -1.398406
C  6.081508 1.092027 -1.033443
H  -1.303032 -0.010184 -1.035845
H  -2.736793 -0.365477 1.642703
H  -2.768862 -4.704352 0.235865
H  0.079927 1.827876 -0.881189
H  -0.628365 -0.526893 2.718815
H  1.506196 -4.376119 -0.540287
H  -4.150978 1.520835 1.689494
H  -3.620705 -0.617779 -2.057342
H  1.387778 -0.506204 -0.426251
H  -5.275781 0.930042 -3.171633
H  2.088625 2.875822 2.829873
H  3.255199 -2.923782 -0.886442
H  -1.262557 -6.535087 -0.089121
H  1.53743 1.467227 4.704143
H  1.53505 3.734207 -0.564862
H  -5.776866 3.385175 1.575345
H  -6.878309 3.585425 -1.328527
H  2.806822 0.779718 -0.050811
H  5.524996 -2.246793 -1.595121
H  7.33945 -0.506228 -1.753487
H  3.713147 3.048661 0.068094
H  6.692296 2.927103 -0.806421
