program: Gaussian 09
title: 000155276
version: EM64L-G09RevD.01
frameworkgroup: C1[X(C3H8N2O)]
method: RPBEPBE
basis: SDD
operation: Freq
keyword: #pfreq=noraman
keyword: PBEPBE/SDD
title: #p freq=noraman PBEPBE/SDD
converged: YES YES NO NO
title: Mulliken charges:
elementType: O N N C C C H H H H H H H H
charge: -0.299224 -0.055506 0.062281 -0.290305 -0.666088 -0.622531 0.220478 0.220996 0.238460 0.238015 0.204594 0.235973 0.276227 0.236629
chargesum: 0.00000
title: Mulliken charges with hydrogens summed into heavy atoms:
elementType: O N N C C C
charge: -0.299224 -0.055506 0.062281 0.151169 0.014982 0.126298
polarizability: 6.22379932e+01 -6.59768839e+00 5.96927732e+01 4.40682832e-02 1.82495896e-02 3.65411292e+01
1716.lowfreq: -16.1870 -12.3097 -11.2879 0.0007 0.0011 0.0014 51.9315 76.2263 186.5315
frequency: 51.7496 76.1709 186.5246 233.0850 282.9573 340.5537 372.2895 452.7441 624.8365 799.4989 802.9020 912.6970 1033.4856 1064.0326 1087.9042 1139.7364 1172.0034 1263.7045 1265.2853 1334.7132 1370.1250 1400.2170 1404.3435 1460.8019 1467.2974 1478.4491 1480.9033 1493.2998 2958.0196 2976.5826 3000.0871 3005.4871 3062.3767 3096.8688 3100.9855 3117.5674
redmass: 1.9260 1.0845 2.5369 3.8376 1.2188 3.1450 6.8146 3.5402 4.2287 1.1164 4.6664 2.1454 2.6525 1.8031 1.2781 1.5476 3.1868 1.1097 3.9121 6.0137 1.4960 1.2430 1.2209 1.0578 1.0412 1.0489 1.0480 1.0871 1.0573 1.0331 1.1038 1.0367 1.1019 1.0990 1.0992 1.1007
irintensity: 0.0280 0.1339 1.7633 6.5524 0.9378 4.8513 1.6315 0.9493 0.9841 5.6318 12.0506 70.5459 77.4854 1.7637 0.3821 4.3556 69.4821 1.0466 5.2039 118.6625 9.6032 23.8859 25.5887 16.7620 11.4988 24.9914 1.9785 18.3944 33.9685 46.0069 28.5028 20.4156 27.8779 2.7377 30.3739 26.7148
temp: 298.150 k
press: 1.00000 atm
elementType: 8 7 7 6 6 6 1 1 1 1 1 1 1 1
symmnumber: 1
zpe: 301281.2 jmol-1
zpe.correction: 0.114752 hartree
zpe.thermalcorrener: 0.122270 hartree
zpe.thermalcorrenthalpy: 0.123214 hartree
zpe.thermalcorrgfe: 0.082782 hartree
zpe.sumelectzpe: -303.274832 hartree
zpe.sumelectthermal: -303.267314 hartree
zpe.sumelectthermalent: -303.266370 hartree
zpe.sumelectthermalfe: -303.306802 hartree
dipole: -2.6337 3.8492 0.0003
dipole: 4.6640
quadrupole: -38.5381 -38.4043 -35.9044
quadrupole: 4.4379 0.0042 -0.0021
quadrupole: -0.9225 -0.7887 1.7112 4.4379 0.0042 -0.0021
hfenergy: -303.3895837 hartree
pointgroup: C01 [X(C3H8N2O1)]
dipole: -1.2252393 -1.3374973 -0.2773567 debye
dipolederiv: -1.0607934 -0.6682513 -0.1552853 0.0432012 -0.3431486 -0.0124089 -0.0551372 -0.0647336 -0.2441852 -0.4374167 -0.1066587 -0.0301085 -0.5473445 -0.6146569 -0.0948365 -0.0940781 -0.0613929 -0.2413197 0.8587359 0.8792668 0.1917333 0.6611808 0.6110182 0.1439746 0.1610322 0.159804 -0.0322926 0.5808972 0.0901452 0.0291825 0.0106557 0.0900944 -0.0340127 0.0202266 -0.0276629 0.3382584 0.0150428 0.0661803 0.005956 0.1010003 -0.0339645 -0.0040068 0.00989 -0.0068383 0.0560158 -0.0946719 -0.1583891 -0.0494494 -0.0549102 0.1087342 -0.0232925 -0.0357661 -0.0328848 0.2451663 -0.0331227 -0.0116331 0.0001699 -0.0236644 0.012981 -0.1040841 -0.0708172 -0.1249871 -0.1092688 -0.0447872 -0.0317881 -0.0008034 -0.0589298 -0.0517405 0.1121427 0.0651938 0.1360673 -0.0344629 0.1035252 -0.0258362 -0.0491848 0.0159479 0.0414983 -0.0689994 -0.0213671 -0.081974 -0.0799665 0.0891793 -0.0548038 0.0615069 -0.0057836 -0.0039381 0.0886753 0.0457561 0.0946734 -0.0211924 -0.1861355 -0.0136011 -0.0243388 -0.0550934 0.0810709 -0.0079989 -0.0299138 -0.0047515 0.1060857 0.1053343 -0.0364847 0.0977915 -0.014378 -0.0518475 0.0678095 0.0560228 0.1131109 -0.02366 -0.0210435 0.0643647 -0.0047699 -0.0809359 0.1555285 -0.0051753 -0.0241427 0.0071375 0.1372697 0.1252563 0.0074891 -0.0724 0.0090538 -0.0016294 -0.0577869 -0.0268996 -0.1055681 -0.0964478 unknown
polarizability: 63.7876508|5.6784728|57.469781|2.8075805|3.3392418|37.2144639 unknown
InChI: InChI=1S/C3H8N2O/c1-3-5(2)4-6/h3H2,1-2H3
charge 0 multiplicity 1
14 atoms
O  1.917721 0.849223 0.339202
N  0.0936 -0.441765 0.023823
N  0.633458 0.817569 0.239832
C  -1.37744 -0.542771 -0.098132
C  -2.110684 0.802361 0.023927
C  0.916553 -1.657394 -0.084429
H  -1.605734 -1.011599 -1.077705
H  -1.736907 -1.243352 0.68383
H  -1.925362 1.277604 1.000623
H  -1.79012 1.510035 -0.757485
H  -3.195577 0.622457 -0.083264
H  0.637083 -2.386034 0.698649
H  1.969568 -1.356174 0.046549
H  0.785541 -2.128459 -1.076119
