program: Gaussian 09
title: 000013971
version: EM64L-G09RevD.01
frameworkgroup: C1[X(C14H8N4O5)]
method: RPBEPBE
basis: SDD
operation: Freq
keyword: #p
keyword: freq=noraman
keyword: PBEPBE/SDD
title: #p freq=noraman PBEPBE/SDD
converged: YES YES NO YES
title: Mulliken charges:
elementType: O O O O O N N N N C C C C C C C C C C C C C C H H H H H H H H
charge: -0.257341 -0.199572 -0.199574 -0.197170 -0.197173 -0.110883 -0.110772 0.028910 0.028911 0.333933 0.334060 0.120842 0.120717 -0.343327 -0.343338 -0.326009 -0.326052 0.381783 0.381779 -0.347111 -0.347101 -0.354984 -0.354987 0.266035 0.266049 0.287423 0.287404 0.293496 0.293496 0.295276 0.295278
chargesum: 0.00000
title: Mulliken charges with hydrogens summed into heavy atoms:
elementType: O O O O O N N N N C C C C C C C C C C C C C C
charge: -0.257341 -0.199572 -0.199574 -0.197170 -0.197173 -0.110883 -0.110772 0.028910 0.028911 0.333933 0.334060 0.120842 0.120717 -0.077293 -0.077289 -0.038585 -0.038648 0.381783 0.381779 -0.053615 -0.053605 -0.059708 -0.059709
polarizability: 4.86379604e+02 -3.06623959e-03 2.11905184e+02 -3.12857015e-03 -3.33592548e-03 7.30823892e+01
1716.lowfreq: -6.5333 -2.9941 -0.0009 0.0003 0.0010 0.7849 26.7960 29.9568 34.6787
frequency: 26.7485 29.9483 34.6787 60.2591 60.4362 68.7396 82.6926 112.9679 138.4850 171.8627 200.6575 224.4419 249.4353 297.8759 297.9025 354.7590 380.1166 408.6209 409.1085 462.6998 479.1477 483.3932 500.0591 509.6490 510.7067 533.8162 622.7164 623.2955 659.1828 663.1898 668.6757 687.4072 690.0187 700.6691 746.7968 754.6056 789.0326 790.1577 856.3007 858.1862 878.2083 881.8907 887.4240 898.9396 958.8827 974.4668 998.2962 999.6981 1003.1915 1009.0837 1009.0920 1009.3024 1051.2057 1091.1743 1092.0375 1112.3960 1113.5903 1181.3294 1181.8970 1195.5565 1214.3127 1219.2473 1265.1839 1300.1268 1301.5714 1365.4221 1367.8313 1399.2295 1402.7069 1417.5641 1420.2431 1438.6978 1444.4468 1519.2564 1530.9087 1589.7435 1591.7385 1613.7113 1614.0897 3167.6509 3167.9115 3168.7131 3168.7818 3189.1906 3189.2242 3191.9054 3191.9389
redmass: 8.0701 5.9829 10.4772 9.2012 10.4164 5.9746 7.1096 8.9055 10.1613 10.3535 8.4908 9.3265 7.1372 12.8831 7.6646 7.3914 7.0848 2.8867 2.8898 8.3482 11.1877 3.8084 4.0299 6.8981 7.9801 6.5054 7.1865 7.1395 8.7329 5.5132 4.5732 8.8652 5.5312 8.8602 4.6650 4.8847 9.5306 9.4001 1.2711 1.2584 1.5814 1.6271 14.0355 13.4408 10.7981 9.5137 1.3530 1.3543 3.4830 2.8451 1.3627 1.3626 4.9470 3.3624 3.1068 1.3188 1.3607 1.3878 1.4007 4.9429 4.9068 4.8058 4.9314 1.2780 1.3266 7.3533 8.5149 9.9124 10.4325 3.9355 3.6813 2.9739 2.7799 5.1537 6.1138 8.1175 8.1427 6.1594 6.2021 1.0899 1.0899 1.0905 1.0905 1.0957 1.0958 1.0971 1.0971
irintensity: 1.4148 0.0000 0.9606 0.0290 2.4004 0.0000 6.3075 1.8230 2.2183 1.4797 0.0000 6.3596 0.0003 0.2096 0.3085 0.0000 1.2905 0.0000 0.0090 3.6231 3.3448 10.9636 0.0000 0.2281 10.1164 0.1945 0.0042 0.0245 0.0000 24.6258 0.0002 0.9097 61.2408 5.4942 0.0000 0.1206 6.8566 96.5777 0.0000 4.7481 0.0007 125.4807 7.9120 18.1778 7.8634 13.2448 0.0000 1.7634 0.0027 4.8444 0.0054 0.1400 7.4551 51.2663 5.5211 0.4563 22.3503 148.4029 15.4672 2.1110 842.1727 59.1823 4.1559 0.0661 0.1505 13.9594 153.1062 17.1993 11.1504 51.9986 72.2500 45.5981 33.1835 31.8944 3.8527 0.8617 0.8647 2.0140 73.5517 1.2620 1.3673 0.2000 0.4696 0.1008 1.7269 4.7351 0.1746
temp: 298.150 k
press: 1.00000 atm
elementType: 8 8 8 8 8 7 7 7 7 6 6 6 6 6 6 6 6 6 6 6 6 6 6 1 1 1 1 1 1 1 1
symmnumber: 1
zpe: 539386.9 jmol-1
zpe.correction: 0.205442 hartree
zpe.thermalcorrener: 0.223726 hartree
zpe.thermalcorrenthalpy: 0.224671 hartree
zpe.thermalcorrgfe: 0.155785 hartree
zpe.sumelectzpe: -1131.633208 hartree
zpe.sumelectthermal: -1131.614923 hartree
zpe.sumelectthermalent: -1131.613979 hartree
zpe.sumelectthermalfe: -1131.682865 hartree
dipole: 0.0005 0.1764 0.0004
dipole: 0.1764
quadrupole: -207.5870 -136.3356 -130.4444
quadrupole: 0.0037 -0.0056 -0.0018
quadrupole: -49.4646 21.7868 27.6779 0.0037 -0.0056 -0.0018
hfenergy: -1131.8386499 hartree
pointgroup: C01 [X(C14H8N4O5)]
dipole: -0.0001921 -0.0693832 0.0001927 debye
polarizability: 486.3795987|0.0386112|211.9051817|-0.0045955|-0.0335305|73.0823972 unknown
InChI: InChI=1S/C14H8N4O5/c19-17(20)11-5-1-9(2-6-11)13-15-16-14(23-13)10-3-7-12(8-4-10)18(21)22/h1-8H
charge 0 multiplicity 1
31 atoms
O  -0.000237 -0.140715 0.000029
O  6.648744 2.269466 -0.001151
O  -6.649783 2.26756 -0.000216
O  7.441407 0.128965 -0.000271
O  -7.441973 0.12688 -0.000222
N  0.713525 -2.309024 0.000719
N  -0.713155 -2.309303 0.000601
N  6.479895 0.989604 -0.000352
N  -6.480652 0.987735 -0.000241
C  2.462651 -0.494573 0.000103
C  -2.463092 -0.495522 0.000163
C  1.107329 -1.025688 0.000266
C  -1.107701 -1.026356 0.000301
C  2.701739 0.907368 -0.000364
C  -2.702492 0.906367 0.000005
C  3.556241 -1.406519 0.000427
C  -3.556478 -1.407723 0.000182
C  5.086552 0.473555 -0.000192
C  -5.087221 0.472002 -0.0001
C  4.018969 1.397601 -0.000518
C  -4.019843 1.396288 -0.000124
C  4.874698 -0.923764 0.000276
C  -4.875052 -0.925269 0.000052
H  1.857153 1.602152 -0.000604
H  -1.858075 1.601347 -0.000014
H  3.352639 -2.481251 0.000791
H  -3.352657 -2.482412 0.0003
H  4.235631 2.46861 -0.000881
H  -4.23676 2.467247 -0.000239
H  5.73444 -1.598269 0.000518
H  -5.734646 -1.599963 0.000058
